program: Gaussian 09
title: 000292327
version: EM64L-G09RevD.01
frameworkgroup: C1[X(C14H15NO4S)]
method: RPBEPBE
basis: SDD
operation: Freq
keyword: #p
keyword: freq=noraman
keyword: PBEPBE/SDD
title: #p freq=noraman PBEPBE/SDD
converged: YES YES NO NO
title: Mulliken charges:
elementType: S O O O O N C C C C C C C C C C C C C C H H H H H H H H H H H H H H H
charge: 0.986200 -0.414238 -0.278389 -0.516513 -0.505244 -0.683816 -0.084623 -0.283540 -0.272338 -0.210396 -0.208235 0.514900 -0.382618 -0.382480 0.362193 -0.349891 -0.373101 -0.223025 -0.196050 -0.256750 0.244610 0.234178 0.220940 0.222281 0.280793 0.277704 0.234122 0.233628 0.246916 0.250583 0.222343 0.227186 0.317878 0.317600 0.227192
chargesum: 0.00000
title: Mulliken charges with hydrogens summed into heavy atoms:
elementType: S O O O O N C C C C C C C C C C C C C C
charge: 0.986200 -0.414238 -0.278389 -0.516513 -0.505244 -0.048338 -0.084623 0.195247 0.170883 0.070398 0.069470 0.514900 -0.148496 -0.148852 0.362193 -0.102976 -0.122518 -0.000682 0.031136 -0.029558
polarizability: 2.90484704e+02 -3.66803188e+01 2.02703239e+02 1.50804011e+01 5.50252708e+00 1.36898101e+02
1716.lowfreq: -16.1429 -13.1507 -4.7019 -3.4798 -0.0010 -0.0008 0.0009 9.6565 21.9619
frequency: -15.9599 9.1509 21.8085 34.7742 48.6767 66.9593 94.6639 124.0711 128.6573 131.8441 142.9173 218.6879 229.6850 232.1964 260.0832 287.8690 326.4559 346.6661 374.5559 405.6887 411.8749 413.4432 419.6754 437.9211 451.4273 475.9819 502.3262 516.6148 561.1831 581.3864 610.1762 615.2239 622.0585 691.6731 716.8155 758.0650 788.9204 806.1628 816.5467 819.6180 828.8032 835.6250 844.9629 890.1289 944.6025 954.7679 955.7471 960.5962 967.7143 976.8808 981.7181 981.9976 987.9530 1022.4742 1023.3497 1054.0196 1083.1762 1090.7566 1108.0786 1132.1540 1167.0498 1173.3502 1179.6248 1184.6455 1219.1995 1263.8383 1300.8024 1314.6935 1318.8102 1325.4501 1375.6805 1392.4274 1401.1472 1438.6352 1443.3656 1472.5848 1480.5457 1489.8079 1490.4683 1584.1229 1592.0256 1611.7711 1615.2990 1650.8849 2974.7657 2996.9145 3037.1836 3077.4932 3127.7834 3136.8990 3137.2303 3139.1438 3155.1727 3163.7437 3164.4565 3167.3835 3173.0090 3560.8245 3699.2669
redmass: 4.7316 4.6043 5.0223 4.8049 6.1209 5.5379 3.0547 2.9659 7.5516 4.6554 5.5274 7.0737 5.1262 8.7342 6.7926 6.2553 5.9250 5.5758 8.1504 3.3081 2.9251 2.4381 1.0940 4.0438 1.4365 8.6548 2.8603 2.9116 6.4461 8.2870 6.4459 7.5219 6.9105 2.0381 2.9190 1.6536 6.6314 5.2024 1.2578 1.2494 7.1851 1.8877 1.1947 1.4501 6.9275 11.0347 1.3874 1.3601 1.4045 6.7443 4.7679 1.3014 7.0814 2.0466 1.4427 2.5810 1.5366 3.1191 1.4880 1.1928 1.0795 1.1233 1.1649 1.1162 3.5142 1.1390 1.2946 1.3292 1.2350 2.5908 1.8090 3.3231 5.2371 3.9289 2.3543 1.4857 1.2951 1.2001 2.9095 7.3532 6.3936 6.2687 4.8600 1.2238 1.0551 1.0556 1.1072 1.1100 1.0848 1.0890 1.0891 1.0891 1.0925 1.0956 1.0957 1.0970 1.1005 1.0454 1.1040
irintensity: 0.0578 0.7294 1.1608 0.2997 0.4526 0.9166 1.2979 3.0482 0.3886 4.5184 4.5416 1.6182 0.6980 10.3851 4.9135 26.4588 6.8543 9.7089 2.1561 1.2905 0.0405 0.0006 0.0416 11.3066 294.0921 179.6310 12.1128 3.7578 147.1319 21.9410 1.2782 69.4550 0.5013 34.3165 0.2361 90.2241 13.3493 6.1741 0.5309 1.2290 117.2760 63.3989 8.4530 7.6305 155.8710 82.1770 3.9882 0.0319 1.9230 42.7357 5.6871 0.6768 35.0287 29.4715 1.9724 63.2778 12.9168 16.4998 0.5767 13.4111 10.9238 7.9022 51.2499 42.0798 290.8532 2.2508 4.3701 2.4609 2.7500 74.0819 1.4615 19.0937 4.6784 1.8364 4.5120 84.6120 71.6328 0.5194 60.3362 7.8927 32.3691 112.9794 178.6236 274.1691 16.8978 41.8515 15.2975 32.1310 3.2704 11.9017 11.3657 11.6549 36.0087 20.8564 0.7724 11.6430 6.8562 129.3487 27.2709
temp: 298.150 k
press: 1.00000 atm
elementType: 16 8 8 8 8 7 6 6 6 6 6 6 6 6 6 6 6 6 6 6 1 1 1 1 1 1 1 1 1 1 1 1 1 1 1
symmnumber: 1
zpe: 695781.1 jmol-1
zpe.correction: 0.265009 hartree
zpe.thermalcorrener: 0.284047 hartree
zpe.thermalcorrenthalpy: 0.284991 hartree
zpe.thermalcorrgfe: 0.214191 hartree
zpe.sumelectzpe: -1294.545443 hartree
zpe.sumelectthermal: -1294.526405 hartree
zpe.sumelectthermalent: -1294.525461 hartree
zpe.sumelectthermalfe: -1294.596260 hartree
dipole: -5.0709 7.4955 -0.6306
dipole: 9.0716
quadrupole: -80.7585 -122.7884 -126.4911
quadrupole: -28.4849 3.9265 3.1576
quadrupole: 29.2541 -12.7757 -16.4784 -28.4849 3.9265 3.1576
hfenergy: -1294.8104517 hartree
pointgroup: C01 [X(C14H15N1O4S1)]
dipole: -1.8637318 -2.6321075 1.5285951 debye
polarizability: 285.0182372|27.05016|197.026907|-38.6706926|-22.2706946|148.0408995 unknown
InChI: InChI=1S/C14H15NO4S/c15-12-6-8-14(9-7-12)20(16,17)19-11-10-18-13-4-2-1-3-5-13/h1-9H,10-11,15H2
charge 0 multiplicity 1
35 atoms
S  -2.039102 1.570084 -0.727412
O  -0.501871 0.891348 0.130587
O  3.085271 0.907928 -0.573097
O  -1.827502 1.326655 -2.319194
O  -2.340991 3.055814 -0.157246
N  -6.034303 -2.355316 1.517346
C  -3.250883 0.361462 -0.033517
C  0.754674 1.420934 -0.445517
C  1.809594 0.375325 -0.073082
C  -3.935365 0.701316 1.148515
C  -3.457509 -0.852733 -0.715259
C  -5.111229 -1.455707 1.004497
C  -4.869989 -0.210303 1.664332
C  -4.39451 -1.759296 -0.195411
C  4.244086 0.146753 -0.335467
C  4.257611 -1.097688 0.342292
C  5.447751 0.708008 -0.830308
C  5.4885 -1.773008 0.518986
C  6.663953 0.021953 -0.645916
C  6.693342 -1.223482 0.030014
H  0.672141 1.511014 -1.545762
H  0.999864 2.402641 -0.002923
H  1.576456 -0.596365 -0.550663
H  1.84903 0.24212 1.026106
H  -3.750143 1.662922 1.637314
H  -2.912628 -1.068355 -1.6397
H  -5.418138 0.035212 2.580809
H  -4.577074 -2.707685 -0.713051
H  3.336481 -1.543974 0.728729
H  5.404308 1.670273 -1.349796
H  5.498475 -2.735458 1.043261
H  7.591703 0.460064 -1.030652
H  -6.552095 -2.146814 2.366597
H  -6.216305 -3.240553 1.052552
H  7.640796 -1.753888 0.171334
