program: Gaussian 09
title: 000292338
version: EM64L-G09RevD.01
frameworkgroup: C1[X(C20H26N4)]
method: RPBEPBE
basis: SDD
operation: Freq
keyword: #pfreq=noraman
keyword: PBEPBE/SDD
title: #p freq=noraman PBEPBE/SDD
converged: YES YES NO NO
title: Mulliken charges:
elementType: N N N N C C C C C C C C C C C C C C C C C C C C H H H H H H H H H H H H H H H H H H H H H H H H H H
charge: -0.151738 -0.151721 -0.067567 -0.067486 0.410197 0.410173 0.460508 0.460452 -0.360141 -0.360118 -0.341853 -0.341856 -0.405328 -0.405353 -0.411033 -0.410996 -0.427346 -0.427475 -0.646924 -0.647083 -0.646921 -0.647087 -0.336774 -0.336819 0.233842 0.233823 0.233880 0.233871 0.221395 0.221409 0.267581 0.267605 0.212132 0.185141 0.212109 0.185156 0.234832 0.234371 0.215375 0.235668 0.235146 0.214969 0.234335 0.215367 0.234858 0.235154 0.235652 0.214966 0.200806 0.200846
chargesum: 0.00000
title: Mulliken charges with hydrogens summed into heavy atoms:
elementType: N N N N C C C C C C C C C C C C C C C C C C C C
charge: -0.151738 -0.151721 -0.067567 -0.067486 0.410197 0.410173 0.460508 0.460452 -0.126299 -0.126296 -0.107973 -0.107985 -0.183933 -0.183945 -0.143452 -0.143391 -0.030072 -0.030210 0.037654 0.038700 0.037639 0.038685 -0.135967 -0.135974
polarizability: 2.90034035e+02 7.03179722e-02 3.54936078e+02 3.53294606e+01 2.13645850e-02 2.06650330e+02
1716.lowfreq: -0.0007 0.0001 0.0004 2.6023 5.1912 9.2104 13.1608 14.2925 18.6873
frequency: 9.0114 14.2312 18.2326 39.2687 50.6643 59.0725 75.6771 77.9081 91.2591 103.0097 111.1546 114.5378 151.9226 158.6396 164.3588 203.2718 203.6476 231.3397 236.0349 251.8459 253.5323 282.6395 289.1531 321.3696 364.2714 387.9604 394.9895 407.0445 426.1307 428.4468 435.9448 449.0872 475.3186 485.1335 508.4817 528.1550 547.6486 571.6864 578.9889 633.3955 634.1767 721.2448 722.2159 739.9836 740.7763 806.7365 806.9368 826.5894 826.7747 842.0680 845.1097 859.2267 914.1594 937.9604 942.4934 943.0476 943.1367 971.5792 975.0876 985.5214 986.0281 997.6037 997.6416 1031.9034 1036.6794 1058.0893 1058.1603 1091.7366 1107.0216 1107.0377 1109.3660 1109.3696 1128.3539 1128.6464 1165.2588 1165.2891 1189.3099 1192.9578 1206.1858 1231.9259 1252.8933 1254.5024 1261.9631 1262.0347 1309.4288 1316.0189 1323.2960 1334.9045 1360.8420 1362.2706 1365.8295 1366.6881 1393.8506 1393.9023 1428.8132 1428.8902 1444.2469 1444.6098 1452.6620 1459.1368 1459.2181 1464.0034 1464.0129 1465.9256 1474.8848 1474.9142 1493.6786 1493.7042 1506.7064 1506.8374 1530.2016 1531.0436 1557.4788 1557.5384 1614.6069 1615.9924 1635.1313 1635.2807 2909.7837 2912.9441 2913.0833 2919.4870 2938.5439 2938.5770 2946.4740 2946.8198 3003.3017 3003.3386 3006.7006 3006.7788 3016.6581 3023.0471 3095.2811 3095.3349 3104.7819 3104.8586 3113.9478 3114.0166 3141.9898 3142.1021 3162.6587 3162.8222 3166.5580 3166.7406
redmass: 4.9886 3.2801 3.1492 4.7630 4.4814 4.4358 2.4996 2.5048 3.8177 2.0135 2.1557 3.6344 1.8628 2.0481 3.0400 1.1305 1.1365 3.6346 3.1040 2.2649 2.3689 3.8357 3.4804 4.6375 3.0012 3.3840 4.2644 2.7129 2.9850 3.0361 3.3747 3.6111 3.3256 3.2668 2.8369 2.2737 2.7129 4.1949 3.3160 7.0662 7.0341 4.4396 4.6853 3.3260 3.2932 1.3304 1.3240 1.6432 1.6512 4.0625 4.7646 2.6443 2.0671 1.3916 2.1756 3.0064 1.8807 1.5537 1.6182 1.4814 1.4560 2.8445 2.8887 3.3783 2.4038 1.4961 1.4966 2.2630 1.2490 1.2487 1.3111 1.3107 1.4186 1.4159 1.6831 1.6849 1.1754 1.1576 1.1276 1.1966 1.9104 1.7210 2.9212 2.9196 1.3796 1.4818 1.3327 1.2755 2.4566 2.5436 2.8961 2.7316 2.3443 2.4934 1.3707 1.3622 2.2837 2.3857 1.1320 1.2229 1.2150 1.0404 1.0404 1.1250 1.0461 1.0461 1.0950 1.0951 1.1227 1.1296 2.6788 2.6697 7.0610 7.0165 6.0693 6.4123 6.4882 6.5627 1.0778 1.0773 1.0820 1.0628 1.0368 1.0369 1.0394 1.0394 1.0995 1.0995 1.1025 1.1025 1.0968 1.0928 1.0959 1.0959 1.0940 1.0940 1.0892 1.0892 1.0872 1.0872 1.0937 1.0937 1.0946 1.0945
irintensity: 0.2390 0.0022 0.3922 4.2944 0.1755 0.6320 1.6766 0.7843 0.4860 2.2371 16.6384 0.5667 1.8273 15.5359 6.4760 0.0548 0.0368 6.1796 0.1319 1.4080 0.0929 13.6211 1.6454 11.0832 14.3969 9.9517 0.1744 1.7600 3.5068 0.2480 0.6899 0.3548 9.4712 0.5769 33.9527 7.5899 9.6770 7.0381 5.2706 0.2132 0.6833 3.8670 2.1406 0.3244 0.2755 25.0729 6.9260 83.2255 37.4343 1.6822 0.0086 4.9763 13.8875 1.3695 8.8441 26.8569 13.5810 1.0456 9.2411 9.6872 1.6329 0.3648 0.2491 7.7447 21.0742 11.1685 39.9611 9.5369 0.1355 0.1068 0.8579 0.9895 0.0933 8.1696 3.5349 3.5779 83.9282 89.8736 12.7618 0.7962 9.1088 15.8818 12.6681 44.2666 28.0354 41.8093 6.3077 23.7458 113.3648 147.7208 70.4859 47.3179 1.2546 3.6659 10.2638 13.3317 19.4276 12.0674 73.0558 14.6779 6.4001 0.0223 0.0222 18.3058 31.6303 9.8390 5.5443 0.9851 37.2913 38.8802 204.1803 286.8871 27.8145 43.0544 294.0849 431.7132 155.9081 114.6156 47.9371 73.6568 68.3160 181.7013 57.3595 160.8636 110.8076 113.9251 19.9695 4.0539 110.4256 44.9948 30.6554 105.7335 3.8851 4.5399 44.4903 54.5741 1.8771 25.6456 3.4817 3.1889 20.4792 29.8553 12.7384 13.3744
temp: 298.150 k
press: 1.00000 atm
elementType: 7 7 7 7 6 6 6 6 6 6 6 6 6 6 6 6 6 6 6 6 6 6 6 6 1 1 1 1 1 1 1 1 1 1 1 1 1 1 1 1 1 1 1 1 1 1 1 1 1 1
symmnumber: 1
zpe: 1100399.5 jmol-1
zpe.correction: 0.419120 hartree
zpe.thermalcorrener: 0.444051 hartree
zpe.thermalcorrenthalpy: 0.444995 hartree
zpe.thermalcorrgfe: 0.360060 hartree
zpe.sumelectzpe: -994.912242 hartree
zpe.sumelectthermal: -994.887311 hartree
zpe.sumelectthermalent: -994.886367 hartree
zpe.sumelectthermalfe: -994.971303 hartree
dipole: -0.0058 -6.7309 0.0025
dipole: 6.7309
quadrupole: -112.2536 -127.7883 -133.6352
quadrupole: -0.0011 8.0603 0.0122
quadrupole: 12.3054 -3.2293 -9.0762 -0.0011 8.0603 0.0122
hfenergy: -995.3313623 hartree
pointgroup: C01 [X(C20H26N4)]
dipole: 0.0001991 2.6480844 -0.017767 debye
polarizability: 283.3549504|-0.2841032|354.9283385|-41.9571121|-1.052961|213.3371541 unknown
InChI: InChI=1S/C20H26N4/c1-23(2)19-9-5-17(6-10-19)15-21-13-14-22-16-18-7-11-20(12-8-18)24(3)4/h5-12,15-16H,13-14H2,1-4H3
charge 0 multiplicity 1
50 atoms
N  5.046352 2.345111 -0.617561
N  -5.048093 2.346024 0.588502
N  1.543723 -3.179874 -0.034135
N  -1.538866 -3.182009 0.081277
C  4.246633 1.24734 -0.284788
C  -4.246496 1.245087 0.271092
C  2.601515 -1.017829 0.393999
C  -2.597741 -1.026592 -0.376273
C  3.59213 1.163102 0.986498
C  -3.588964 1.145988 -0.997571
C  4.05299 0.163478 -1.207052
C  -4.053862 0.172823 1.207046
C  2.792001 0.053498 1.307033
C  -2.787115 0.033303 -1.302776
C  3.251158 -0.934873 -0.869761
C  -3.25027 -0.928784 0.884936
C  0.666982 -4.265938 0.436048
C  -0.659908 -4.272956 -0.37325
C  5.229402 3.438741 0.343958
C  5.702204 2.410265 -1.929508
C  -5.23051 3.427285 -0.387007
C  -5.706315 2.426984 1.898343
C  1.759157 -2.164531 0.764501
C  -1.753553 -2.177054 -0.73061
H  3.707119 1.963655 1.722449
H  -3.702797 1.937461 -1.743478
H  4.533891 0.185393 -2.189227
H  -4.53683 0.206291 2.187911
H  2.299252 0.015804 2.28747
H  -2.292116 -0.015908 -2.281568
H  3.106244 -1.760215 -1.575232
H  -3.106072 -1.745262 1.600802
H  1.182642 -5.229242 0.255122
H  0.409365 -4.197721 1.518804
H  -1.173787 -5.234571 -0.178818
H  -0.402106 -4.219569 -1.456797
H  5.695344 3.084723 1.286366
H  4.266843 3.925725 0.603199
H  5.889489 4.204904 -0.092463
H  6.397169 1.560209 -2.08627
H  4.966347 2.405098 -2.759482
H  6.286217 3.341412 -2.001298
H  -4.268095 3.912505 -0.650102
H  -5.892827 4.197769 0.038273
H  -5.693676 3.06076 -1.325986
H  -4.971867 2.432277 2.729543
H  -6.401257 1.578653 2.064292
H  -6.290825 3.358683 1.957705
H  1.309129 -2.118563 1.7831
H  -1.30145 -2.143561 -1.748758
