program: Gaussian 09
title: 000292307
version: EM64L-G09RevD.01
frameworkgroup: C1[X(C16H15N3O)]
method: RPBEPBE
basis: SDD
operation: Freq
keyword: #p
keyword: freq=noraman
keyword: PBEPBE/SDD
title: #p freq=noraman PBEPBE/SDD
converged: YES YES NO NO
title: Mulliken charges:
elementType: O N N N C C C C C C C C C C C C C C C C H H H H H H H H H H H H H H H
charge: -0.218916 0.060956 -0.408036 -0.001886 -0.445406 -0.551654 -0.546365 0.311266 0.296832 -0.566710 -0.428854 0.481568 -0.402934 -0.398219 0.276099 0.184360 -0.283010 -0.310401 -0.322397 -0.327895 0.226155 0.219805 0.228893 0.234105 0.229890 0.228045 0.292367 0.241891 0.221518 0.204467 0.287158 0.272728 0.223036 0.247636 0.243905
chargesum: 0.00000
title: Mulliken charges with hydrogens summed into heavy atoms:
elementType: O N N N C C C C C C C C C C C C C C C C
charge: -0.218916 0.060956 -0.120878 -0.001886 0.000554 -0.088655 -0.088429 0.311266 0.296832 -0.274343 -0.186962 0.481568 -0.181416 -0.193753 0.276099 0.184360 -0.010282 -0.087366 -0.074761 -0.083989
polarizability: 4.07988082e+02 1.37649413e+01 1.97114562e+02 3.59931148e+00 3.20636909e+00 9.49704600e+01
1716.lowfreq: -0.8211 -0.0006 -0.0002 0.0003 3.9346 8.1896 22.7928 33.4003 37.9065
frequency: 22.7630 33.3068 37.8881 57.2621 94.9817 106.3876 150.7997 167.3118 198.1134 210.2993 215.5022 236.2655 283.8843 345.1306 360.4113 365.0915 372.5006 419.3060 432.3311 475.5855 499.8106 550.2344 563.4904 611.1308 619.0384 627.7299 659.6843 668.8149 688.7896 715.4677 744.6316 752.7907 787.2589 825.9873 836.9420 850.8876 873.3162 883.8493 890.4002 912.6078 929.7255 939.8048 954.9452 957.5512 963.0948 965.7467 987.4092 1017.7926 1025.5943 1049.5817 1061.2995 1086.4957 1093.8355 1121.8211 1128.7886 1157.3895 1165.6693 1200.4115 1215.0212 1219.1101 1242.9064 1251.9297 1262.8304 1284.9646 1292.6896 1299.7688 1314.5184 1324.5263 1342.6555 1388.4006 1399.4768 1440.8427 1457.1758 1458.4234 1460.8611 1479.4851 1485.0352 1511.5247 1546.2685 1564.2503 1579.8831 1592.0656 1619.6972 1624.3907 2954.8858 2970.2168 2977.3153 3006.2311 3045.0734 3052.4411 3080.1626 3114.1431 3125.9674 3140.7226 3141.5239 3149.8133 3149.8993 3174.4854 3379.2326
redmass: 5.9220 4.1958 5.4260 4.8715 5.0801 5.5080 2.5266 4.4897 3.4699 4.4127 3.4306 3.7468 3.6884 6.5510 3.6023 2.6325 4.7700 5.1440 3.0477 5.0694 4.8789 4.2507 2.8866 5.6776 2.0797 1.4132 6.3377 7.3222 4.4920 2.7369 3.4468 2.9307 4.3835 1.3852 1.6458 2.2983 3.1293 1.9926 1.2618 2.3189 1.3966 1.4705 2.8206 3.1614 1.4713 1.9313 1.4460 2.5237 5.3372 1.6857 2.1442 1.6353 2.7278 2.5012 1.4211 1.6703 1.2679 1.5547 1.4356 1.3216 2.8690 1.9102 1.2496 2.0354 1.3651 6.2611 1.4558 1.5197 1.7809 3.9310 1.8831 4.1989 1.1346 1.1626 1.8735 1.1067 2.3522 1.9526 7.4865 6.7958 5.7364 5.8284 8.2769 7.2517 1.0866 1.0659 1.0659 1.0646 1.0948 1.0945 1.1039 1.0874 1.0873 1.0962 1.0897 1.0967 1.0934 1.0965 1.0750
irintensity: 0.3249 0.1071 0.7132 2.0988 3.5991 9.2049 0.0622 8.4521 3.0679 7.0392 9.9179 9.9249 1.9562 0.2220 4.6015 0.0450 3.5460 12.8656 3.2254 0.7934 6.8953 3.6142 1.1687 1.8356 7.6409 72.1478 1.4799 47.3621 24.7878 9.4705 1.8937 10.7418 2.3676 22.1512 36.8540 6.1084 13.2930 7.8447 3.7806 4.9948 4.5415 26.7261 4.7545 2.7608 17.1666 0.6395 2.6740 0.1911 21.3874 7.5935 21.9747 24.3887 0.9992 82.8346 17.4512 19.5854 14.6912 1.9141 2.0306 23.0217 207.5919 81.6725 3.5733 4.9810 4.1951 0.2046 9.3317 1.1219 9.3700 23.9496 16.0490 10.2039 18.1887 9.6637 10.6006 7.9160 74.7164 215.9608 44.0121 39.5695 25.2908 46.4904 175.4461 19.7486 65.2886 35.5569 26.2298 40.3917 34.9622 30.9016 53.8576 11.8872 11.4245 29.8430 28.2288 14.2498 2.8075 6.2605 16.5307
temp: 298.150 k
press: 1.00000 atm
elementType: 8 7 7 7 6 6 6 6 6 6 6 6 6 6 6 6 6 6 6 6 1 1 1 1 1 1 1 1 1 1 1 1 1 1 1
symmnumber: 1
zpe: 724193.8 jmol-1
zpe.correction: 0.275831 hartree
zpe.thermalcorrener: 0.292654 hartree
zpe.thermalcorrenthalpy: 0.293598 hartree
zpe.thermalcorrgfe: 0.229132 hartree
zpe.sumelectzpe: -856.751248 hartree
zpe.sumelectthermal: -856.734425 hartree
zpe.sumelectthermalent: -856.733480 hartree
zpe.sumelectthermalfe: -856.797947 hartree
dipole: 3.7229 3.8053 -0.4012
dipole: 5.3387
quadrupole: -116.2928 -109.1831 -119.0460
quadrupole: -3.3471 2.2289 1.8603
quadrupole: -1.4522 5.6576 -4.2054 -3.3471 2.2289 1.8603
hfenergy: -857.0270786 hartree
pointgroup: C01 [X(C16H15N3O1)]
dipole: -1.4776522 1.4872843 0.1274113 debye
polarizability: 408.0997256|-12.0194305|196.8231737|6.5595362|-4.4685005|95.1502042 unknown
InChI: InChI=1S/C16H15N3O/c20-16(14-6-8-17-9-7-14)19-18-11-12-4-5-13-2-1-3-15(13)10-12/h4-11,19H,1-3H2
charge 0 multiplicity 1
35 atoms
O  2.254978 -1.97148 -0.051237
N  0.244686 -0.001393 -0.002813
N  1.598522 0.283813 0.061646
N  6.744584 0.471456 0.057114
C  -6.262258 -1.420778 0.111764
C  -4.846264 -1.855732 -0.380486
C  -6.31389 0.122121 -0.12317
C  -4.005605 -0.602353 -0.172265
C  -4.851693 0.535772 -0.025073
C  -2.611046 -0.470741 -0.131329
C  -4.294446 1.815923 0.164078
C  -2.037964 0.821954 0.066611
C  -2.888542 1.954024 0.211675
C  -0.586173 1.013928 0.126836
C  3.982651 -0.267542 0.010514
C  2.549234 -0.747256 -0.005215
C  4.975025 -1.174188 0.458569
C  4.406277 1.011333 -0.436339
C  6.325163 -0.764254 0.470246
C  5.782913 1.329857 -0.394192
H  -6.352548 -1.627923 1.194325
H  -7.077206 -1.957946 -0.403335
H  -4.870267 -2.122492 -1.456772
H  -4.454584 -2.735127 0.160533
H  -6.96433 0.646045 0.600154
H  -6.706558 0.350707 -1.135575
H  -1.941981 -1.330892 -0.239428
H  -4.937703 2.695599 0.280316
H  -2.442784 2.944863 0.367767
H  -0.22933 2.053906 0.285421
H  1.920978 1.250545 0.221308
H  4.679022 -2.177477 0.778625
H  3.705179 1.743322 -0.853552
H  7.11292 -1.440561 0.819452
H  6.140841 2.305869 -0.740875
