program: Gaussian 09
title: 000292277
version: EM64L-G09RevD.01
frameworkgroup: C1[X(C10H18O5)]
method: RPBEPBE
basis: SDD
operation: Freq
keyword: #pfreq=noraman
keyword: PBEPBE/SDD
title: #p freq=noraman PBEPBE/SDD
converged: YES YES NO NO
title: Mulliken charges:
elementType: O O O O O C C C C C C C C C C H H H H H H H H H H H H H H H H H H
charge: -0.447801 -0.248394 -0.248378 -0.227357 -0.227377 -0.076155 0.136489 -0.727533 -0.727649 0.167461 0.167562 -0.258389 -0.258393 -0.664313 -0.664281 0.245228 0.208073 0.247609 0.222328 0.222440 0.208084 0.247564 0.373716 0.236238 0.226035 0.226037 0.236274 0.220887 0.228061 0.253530 0.220892 0.253450 0.228065
chargesum: 0.00000
title: Mulliken charges with hydrogens summed into heavy atoms:
elementType: O O O O O C C C C C C C C C C
charge: -0.074085 -0.248394 -0.248378 -0.227357 -0.227377 0.169072 0.136489 -0.049524 -0.049561 0.167461 0.167562 0.203884 0.203917 0.038165 0.038127
polarizability: 1.41595279e+02 3.44830318e-03 1.18601362e+02 1.13507045e-02 2.27298880e+00 1.17257180e+02
1716.lowfreq: -5.7917 -2.2889 -0.0008 -0.0007 -0.0007 3.9136 12.6655 39.9523 51.6006
frequency: 8.7703 39.8986 51.5826 59.3913 72.0996 88.0197 97.9932 121.5386 134.3391 164.0434 165.9261 194.6446 202.8167 220.7794 224.6226 258.9433 284.5541 306.3889 306.7519 345.9556 354.8358 376.9103 394.5986 432.9732 439.4315 508.7103 590.4289 604.7009 715.5942 721.2238 750.0272 802.1659 815.0727 816.0788 826.6911 882.3168 923.1535 937.8280 968.7715 984.4972 996.4087 1010.8221 1015.1013 1093.7110 1096.3693 1108.7079 1137.1521 1154.4920 1155.5436 1159.0700 1176.9406 1203.8143 1276.7669 1277.3582 1309.3975 1317.7087 1346.9049 1352.6953 1354.2768 1377.6805 1391.7990 1392.0314 1397.5325 1454.8743 1456.2214 1463.3046 1463.7513 1468.1378 1472.1662 1482.2766 1485.1918 1485.3804 1492.1591 1604.1259 1634.3328 2985.1162 2988.1756 2993.8345 2993.9250 3030.5356 3030.9727 3043.1318 3073.8184 3078.4676 3088.5755 3088.7245 3094.6824 3095.7622 3095.8136 3102.0027 3121.9058 3122.0907 3545.6528
redmass: 4.7666 3.1584 3.2007 2.7650 2.6142 2.8140 5.4712 1.9248 3.5440 3.4622 1.8943 1.1330 1.4419 1.1712 1.2326 2.1207 2.7216 2.5735 2.9414 5.5829 5.7953 3.9938 3.3452 3.9514 3.0887 4.4462 8.9395 3.1802 4.6149 3.7161 3.6298 2.5537 1.5864 1.4585 3.5403 2.7249 1.3585 1.9593 1.9173 3.2098 2.0154 2.9697 3.0473 2.3514 2.1538 4.1374 2.7677 1.8644 1.6607 2.6370 1.8472 4.8658 1.1198 1.1239 1.3910 1.3452 1.5324 1.2668 1.2799 1.2048 1.2288 1.2297 1.2067 1.1018 1.0968 1.0435 1.0438 1.0447 1.0505 1.0500 1.0509 1.0507 1.0533 9.6013 10.2352 1.0353 1.0360 1.0361 1.0361 1.0598 1.0600 1.0847 1.0996 1.0984 1.0974 1.0973 1.1002 1.1029 1.1029 1.0989 1.1064 1.1064 1.0649
irintensity: 4.7092 0.5232 0.8538 3.5102 7.3688 16.9182 0.2566 46.1350 2.2737 2.9113 65.7865 6.7853 4.4903 0.3417 1.0284 4.5309 0.3634 6.2071 19.3166 24.5780 38.7955 0.6799 4.3527 0.0853 2.0606 5.4135 8.4887 5.8101 11.7988 9.9697 6.0983 1.5372 8.2934 2.1921 2.1358 4.8335 0.7792 10.4593 3.6605 9.9894 57.6401 92.3040 64.5917 44.2631 35.2896 185.9494 229.8814 52.3225 12.8450 82.2277 18.1459 102.1017 2.1065 6.4353 0.0378 4.9862 39.2957 0.6859 0.6210 9.7364 2.8100 47.6048 33.4681 0.3647 22.5828 0.5551 32.3544 2.9897 0.1982 8.3386 11.4619 24.7512 6.1232 36.3643 282.5265 41.5732 18.9178 28.3070 4.5903 0.0061 53.4187 1.2021 25.6818 66.3235 12.4254 55.1926 2.9913 0.7033 1.1350 33.1322 0.4979 53.6877 23.8595
temp: 298.150 k
press: 1.00000 atm
elementType: 8 8 8 8 8 6 6 6 6 6 6 6 6 6 6 1 1 1 1 1 1 1 1 1 1 1 1 1 1 1 1 1 1
symmnumber: 1
zpe: 710776.0 jmol-1
zpe.correction: 0.270720 hartree
zpe.thermalcorrener: 0.289543 hartree
zpe.thermalcorrenthalpy: 0.290488 hartree
zpe.thermalcorrgfe: 0.221869 hartree
zpe.sumelectzpe: -766.771036 hartree
zpe.sumelectthermal: -766.752213 hartree
zpe.sumelectthermalent: -766.751269 hartree
zpe.sumelectthermalfe: -766.819888 hartree
dipole: -0.0010 -2.6139 -3.6919
dipole: 4.5235
quadrupole: -78.7734 -85.8071 -96.4703
quadrupole: -0.0019 -0.0033 1.3383
quadrupole: 8.2435 1.2099 -9.4534 -0.0019 -0.0033 1.3383
hfenergy: -767.0417563 hartree
pointgroup: C01 [X(C10H18O5)]
dipole: -1.6111268 -0.0020155 0.7560403 debye
polarizability: 120.2251308|0.0453084|141.5944938|-0.5893287|0.1355357|115.6341965 unknown
InChI: InChI=1S/C10H18O5/c1-5-14-8(11)10(13,7(3)4)9(12)15-6-2/h7,13H,5-6H2,1-4H3
charge 0 multiplicity 1
33 atoms
O  2.034192 -0.006218 -0.555768
O  -1.176455 1.571966 0.16636
O  -1.180228 -1.584026 0.149334
O  0.279099 1.824146 -1.639085
O  0.272793 -1.81785 -1.660603
C  0.789176 -0.015961 1.528455
C  0.686403 -0.0072 -0.026187
C  1.516764 1.251893 2.03174
C  1.51092 -1.292633 2.017656
C  -0.069005 1.236075 -0.590013
C  -0.07267 -1.241839 -0.603995
C  -1.99171 2.735637 -0.318762
C  -1.999155 -2.739465 -0.349102
C  -1.405484 4.055019 0.188583
C  -1.417411 -4.066415 0.143457
H  -0.248801 -0.0157 1.905165
H  1.58677 1.230373 3.134471
H  2.537942 1.302561 1.617058
H  0.978664 2.174529 1.747586
H  0.968061 -2.209464 1.723942
H  1.581704 -1.283264 3.120498
H  2.531584 -1.343824 1.601775
H  1.986733 0.000094 -1.547513
H  -2.020147 2.703655 -1.422165
H  -2.991066 2.534008 0.097702
H  -2.997941 -2.539305 0.06944
H  -2.027237 -2.694884 -1.452076
H  -2.066145 4.890999 -0.107291
H  -1.324064 4.054115 1.289271
H  -0.408406 4.234821 -0.246711
H  -2.080891 -4.89679 -0.161761
H  -0.420916 -4.244842 -0.293749
H  -1.336072 -4.078112 1.244088
