program: Gaussian 09
title: 000292264
version: EM64L-G09RevD.01
frameworkgroup: C1[X(C9H12N2O2)]
method: RPBEPBE
basis: SDD
operation: Freq
keyword: #p
keyword: freq=noraman
keyword: PBEPBE/SDD
title: #p freq=noraman PBEPBE/SDD
converged: NO NO NO NO
title: Mulliken charges:
elementType: O O N N C C C C C C C C C H H H H H H H H H H H H
charge: -0.268288 -0.268291 -0.315424 -0.315421 -0.178719 -0.178722 -0.209979 -0.209927 -0.512370 -0.481679 -0.481683 0.155982 0.155961 0.282723 0.282709 0.255749 0.255735 0.236849 0.233004 0.213311 0.234974 0.234974 0.213315 0.332603 0.332613
chargesum: 0.00000
title: Mulliken charges with hydrogens summed into heavy atoms:
elementType: O O N N C C C C C C C C C
charge: -0.268288 -0.268291 0.017179 0.017192 0.104004 0.103987 0.045770 0.045808 -0.042516 -0.033394 -0.033394 0.155982 0.155961
polarizability: 1.17782452e+02 -2.06741369e-03 1.25610215e+02 4.73131209e+00 3.65184596e-03 7.92563534e+01
1716.lowfreq: -23.9774 -19.1064 0.0008 0.0008 0.0009 18.4257 49.0984 66.8731 174.4412
frequency: 47.0662 66.8603 174.4225 174.4737 202.6004 253.4012 308.5750 328.0251 396.3037 428.4207 452.0416 463.8777 501.0711 570.4672 609.9465 646.8918 663.9550 736.7221 759.2619 773.8343 808.2288 811.7208 869.6344 884.7526 906.4787 925.3506 941.6122 957.5909 967.0185 1004.2761 1021.8072 1042.1312 1054.7900 1097.6003 1109.2826 1139.8390 1147.0885 1182.4151 1203.3980 1209.2659 1250.1889 1262.3480 1267.5632 1272.4374 1287.9025 1297.7926 1303.2747 1319.1793 1323.0752 1370.7417 1408.8886 1467.2825 1469.8905 1475.2421 1492.4418 1603.0191 1611.3066 2999.6372 3010.1191 3014.5671 3014.6328 3030.0049 3053.4173 3075.5297 3082.0957 3084.4538 3092.5078 3537.5360 3548.9583
redmass: 3.4481 8.5978 4.1799 3.8318 12.2192 1.9486 5.1695 1.3745 5.5815 4.0009 2.0028 6.9187 3.4364 1.6565 5.3803 2.3958 4.3573 5.8913 3.2046 4.7554 1.5483 4.9252 2.3323 2.5884 2.8067 3.0295 3.1189 2.1454 1.7118 2.2081 1.9436 1.5042 1.7537 2.0826 1.1313 1.2479 1.9639 1.7144 1.5651 1.2132 1.5733 1.3315 1.4047 1.4957 1.7115 1.5024 1.6652 1.5051 1.8296 2.0307 2.9918 1.1243 2.2132 1.0908 1.1002 4.5327 6.6967 1.0587 1.0603 1.0841 1.0623 1.0849 1.1049 1.1050 1.1052 1.0879 1.0928 1.0790 1.0791
irintensity: 0.0656 11.2334 0.3817 0.3586 0.0005 0.2266 8.6819 0.6198 15.1280 0.3102 8.7409 8.7602 0.0923 126.7913 0.0041 140.4720 0.0456 2.5322 2.9172 2.1920 4.3761 7.4341 4.7952 5.4931 14.2819 4.1327 5.7197 0.9291 0.4003 10.9689 28.4776 0.0014 1.2477 76.4405 2.6208 20.6136 0.2077 16.7860 2.3134 2.0506 9.0885 13.5067 2.1012 3.9079 48.5160 3.1953 1.9727 3.2786 18.9756 7.7731 92.9759 3.9094 0.0508 17.1748 5.7384 549.8493 1.6915 30.9809 60.0772 7.7839 30.8301 12.0821 0.4364 24.8136 61.3081 27.6445 12.4284 1.2732 78.9808
temp: 298.150 k
press: 1.00000 atm
elementType: 8 8 7 7 6 6 6 6 6 6 6 6 6 1 1 1 1 1 1 1 1 1 1 1 1
symmnumber: 1
zpe: 537533.2 jmol-1
zpe.correction: 0.204736 hartree
zpe.thermalcorrener: 0.215377 hartree
zpe.thermalcorrenthalpy: 0.216321 hartree
zpe.thermalcorrgfe: 0.168122 hartree
zpe.sumelectzpe: -609.118156 hartree
zpe.sumelectthermal: -609.107514 hartree
zpe.sumelectthermalent: -609.106570 hartree
zpe.sumelectthermalfe: -609.154769 hartree
dipole: 0.2693 0.0001 0.5455
dipole: 0.6083
quadrupole: -60.6229 -101.7892 -73.8096
quadrupole: 0.0021 3.2503 0.0016
quadrupole: 18.1176 -23.0486 4.9310 0.0021 3.2503 0.0016
hfenergy: -609.3228914 hartree
pointgroup: C01 [X(C9H12N2O2)]
dipole: 0.1025176 0.0000058 -0.2162634 debye
dipolederiv: -0.5743339 0.101459 0.0225192 -0.0016263 -1.3164169 0.0626334 0.0517863 -0.0183597 -0.3772039 -0.5743331 -0.1014449 0.0224931 0.001628 -1.3164354 -0.0630211 0.0517378 0.0178539 -0.3772048 -0.5145163 -0.6039563 0.0255462 0.1644996 -0.288974 -0.0288972 0.0625872 0.2022128 -0.3078801 -0.513926 0.6038071 0.0262688 -0.164639 -0.2888661 0.0286971 0.0637157 -0.2025278 -0.3084575 0.1932466 0.0084782 0.0245009 0.0571643 0.0744268 0.016335 0.1255702 -0.002027 0.0827639 0.1932591 -0.0084583 0.0244976 -0.0571489 0.0744407 -0.016347 0.1255573 0.0020243 0.0827718 -0.3159484 0.1061504 0.0104433 0.0358126 -0.0238721 -0.0339933 0.0196001 -0.0636027 0.0786972 -0.3159338 -0.1062015 0.0104205 -0.0358978 -0.0238993 0.0339393 0.0195969 0.0636262 0.0787159 0.0380198 0.0000114 0.02625 0.0000143 -0.0463954 0.0000064 0.002491 -0.0000003 -0.0246317 0.0235379 0.0659559 0.0413675 0.0208542 0.0271518 -0.0065248 0.0157316 -0.0122543 0.1028063 0.0235517 -0.0659496 0.0413566 -0.0208519 0.0271291 0.0065351 0.0157335 0.0122582 0.1028077 0.9779695 0.3898069 -0.1559513 0.0854652 1.4324982 -0.1012092 -0.2995141 -0.1273485 0.2257158 0.9779291 -0.3896661 -0.1563421 -0.0852696 1.4324068 0.1018615 -0.2995286 0.1280523 0.225847 0.0583959 0.0299136 0.0108177 -0.0091386 -0.0953166 -0.0545463 0.0010899 -0.0483877 0.0539386 0.058379 -0.0298925 0.0108034 0.009155 -0.0953509 0.0545498 0.0010882 0.0483848 0.0539389 0.0630356 -0.0106062 0.0367344 0.0150466 0.0195245 0.0496673 0.0157219 0.0683305 -0.0673387 0.0630301 0.0105848 0.036741 -0.0150355 0.0195296 -0.0496539 0.0157267 -0.0683116 -0.0673367 -0.0994506 -0.0000138 0.1477905 -0.0000144 0.0511445 0.0000116 0.1074951 0.0000128 0.0042928 -0.0714358 -0.0000079 -0.1566434 -0.0000129 0.0730556 -0.0000111 -0.1225215 -0.0000062 -0.028284 0.0769705 0.0097528 -0.0096865 -0.0137054 0.008067 0.0724669 0.0498218 0.1076898 -0.1373083 -0.1252934 -0.0832188 -0.0673547 -0.0586716 0.0145488 -0.0227375 -0.1102337 -0.0596441 0.0273971 -0.1253166 0.0831984 -0.0673603 0.0586515 0.0145725 0.0227274 -0.110246 0.0596254 0.0273972 0.0769697 -0.0097416 -0.0096709 0.0137184 0.0080759 -0.0724634 0.049845 -0.107673 -0.1373117 0.2032183 -0.0194119 0.052276 -0.0176514 0.1094712 -0.0004483 0.0738329 -0.0010156 0.3428276 0.2029752 0.0194507 0.0521824 0.0176537 0.1094838 0.0004221 0.0733149 0.0010875 0.3430398 unknown
polarizability: 117.6221229|0.0017538|125.6102138|-5.3419523|0.0089175|79.4166837 unknown
InChI: InChI=1S/C9H12N2O2/c12-8-6-4-1-2-5(3-4)7(6)9(13)11-10-8/h4-7,10-11H,1-3H2
charge 0 multiplicity 1
25 atoms
O  1.278342 -2.763087 0.098624
O  1.2780 2.763342 0.099464
N  2.245679 -0.709514 -0.213645
N  2.245468 0.70998 -0.213798
C  -1.308907 -1.143178 -0.351111
C  -1.309098 1.142979 -0.351048
C  -0.106794 -0.789535 0.596917
C  -0.106944 0.789469 0.596985
C  -1.224784 -0.000063 -1.402527
C  -2.627874 -0.788341 0.397423
C  -2.628013 0.787887 0.397453
C  1.168308 -1.49805 0.144886
C  1.168066 1.498275 0.145167
H  -1.256136 -2.178477 -0.720714
H  -1.256494 2.178309 -0.72059
H  -0.311944 -1.18563 1.608574
H  -0.312213 1.185435 1.608668
H  -0.286703 0.000035 -1.986647
H  -2.079146 -0.000116 -2.101809
H  -2.653619 -1.216969 1.415283
H  -3.498993 -1.186977 -0.152646
H  -3.499191 1.186391 -0.152616
H  -2.653848 1.216475 1.415327
H  3.11097 -1.168658 -0.507341
H  3.111067 1.169317 -0.50628
