program: Gaussian 09
title: 000292315
version: EM64L-G09RevD.01
frameworkgroup: C1[X(C14H13NO6S)]
method: RPBEPBE
basis: SDD
operation: Freq
keyword: #p
keyword: freq=noraman
keyword: PBEPBE/SDD
title: #p freq=noraman PBEPBE/SDD
converged: YES YES NO NO
title: Mulliken charges:
elementType: S O O O O O O N C C C C C C C C C C C C C C H H H H H H H H H H H H H
charge: 0.995766 -0.386681 -0.288244 -0.502251 -0.487980 -0.189361 -0.199648 0.027952 -0.016259 -0.329965 -0.234242 -0.315739 -0.241060 0.410558 -0.167413 -0.348811 0.377296 -0.350471 -0.381629 -0.226176 -0.210693 -0.257875 0.269392 0.226403 0.209111 0.228188 0.330168 0.299344 0.257513 0.296376 0.243456 0.270472 0.224389 0.238219 0.229895
chargesum: 0.00000
title: Mulliken charges with hydrogens summed into heavy atoms:
elementType: S O O O O O O N C C C C C C C C C C C C C C
charge: 0.995766 -0.386681 -0.288244 -0.502251 -0.487980 -0.189361 -0.199648 0.027952 -0.016259 0.165830 0.203057 0.014428 0.058284 0.410558 0.090101 -0.052436 0.377296 -0.107014 -0.111157 -0.001787 0.027526 -0.027980
polarizability: 2.39622764e+02 2.28317381e+01 2.32963147e+02 1.35200085e+01 -1.95261999e+00 1.45684184e+02
1716.lowfreq: -3.8947 -3.5128 -0.0005 0.0003 0.0008 5.7781 13.1813 26.0114 37.0533
frequency: 13.0688 26.0010 37.0192 47.5013 56.2062 76.6549 90.5769 105.4215 124.8686 143.3940 164.7984 192.6485 202.5688 214.1644 235.3066 240.1140 261.4918 293.2314 328.0810 371.8503 400.6650 402.0204 410.5413 414.2182 424.3849 464.5040 494.9533 505.5686 514.9637 532.8130 597.7455 609.8674 636.2070 664.8802 686.0601 694.9296 701.4940 759.4044 761.5173 800.4142 819.6560 825.0420 830.8711 844.7584 891.3939 897.6981 927.3521 958.0721 965.7810 969.6053 980.2047 982.8158 989.5614 1004.8821 1009.3021 1022.8329 1035.9951 1056.3067 1083.7815 1088.2554 1099.9626 1105.7017 1170.3344 1171.9317 1181.0026 1206.7162 1213.8361 1216.2073 1257.6508 1275.7716 1317.5705 1355.2390 1367.3183 1375.1079 1390.7453 1402.2653 1425.3982 1442.8731 1447.8675 1449.5720 1456.9969 1480.8136 1584.2103 1592.0729 1600.7626 1611.0302 2955.3092 2979.7882 3023.8985 3053.3478 3129.5782 3140.8192 3156.5828 3158.6777 3164.7077 3173.0884 3173.7321 3178.4962 3190.1091
redmass: 6.2132 5.8512 8.7111 6.6285 4.7316 7.4544 8.5113 11.0861 5.7810 6.4986 6.1754 4.9718 6.0015 8.1225 5.2603 8.8772 2.8624 5.5108 6.2228 7.9004 5.8121 6.1645 3.9376 2.9984 3.2980 9.7706 5.1852 3.0264 7.0879 7.4518 4.7952 6.3581 7.3467 3.2263 9.7402 2.1375 4.0035 1.6586 3.7638 10.4736 1.4095 1.3800 12.6732 2.9121 3.1198 1.4468 1.4585 1.4263 1.3562 11.6525 5.9106 5.7055 1.3047 2.3952 1.3639 2.1990 2.7677 2.2282 1.8149 1.5608 2.5287 2.2745 1.0601 1.1307 1.2623 3.1659 1.2007 4.8349 1.1058 1.2950 1.3240 1.2428 1.6303 8.4186 4.3230 8.9611 3.0165 2.2536 2.1671 1.1064 1.1665 2.0197 6.8488 6.3578 7.6246 6.2781 1.0570 1.0601 1.1034 1.1039 1.0852 1.0888 1.0922 1.0888 1.0953 1.0940 1.1007 1.0933 1.0978
irintensity: 1.7140 0.1434 1.8383 0.5358 0.2976 2.9410 1.3342 3.5153 1.1504 1.7308 4.0582 2.3697 6.0861 1.7844 2.0816 4.8296 3.5345 5.7688 1.3554 23.1240 12.9287 6.5476 4.7258 0.3120 4.9485 71.0275 0.0988 12.5804 8.2830 90.8440 20.1135 1.6294 5.8840 19.4237 17.5591 32.3741 28.7927 85.2522 14.2574 15.7454 36.1374 22.7788 94.7153 33.5048 24.8455 20.5426 19.3559 7.9397 0.5503 77.3877 0.9510 0.5609 3.1425 44.2004 1.5318 8.4166 41.9093 11.2033 25.0588 11.9573 12.6574 2.5491 8.3020 6.5010 65.0669 59.9454 30.4625 288.7853 2.7911 0.3339 0.1114 19.0616 4.1255 88.8389 10.6063 4.1695 65.1959 5.6355 28.1545 10.5072 57.3906 59.1563 2.5560 23.0353 3.4779 52.0100 29.3875 26.9693 30.6430 20.9260 3.3229 11.1531 27.7983 4.9140 11.4622 6.4452 7.9975 15.4448 2.3135
temp: 298.150 k
press: 1.00000 atm
elementType: 16 8 8 8 8 8 8 7 6 6 6 6 6 6 6 6 6 6 6 6 6 6 1 1 1 1 1 1 1 1 1 1 1 1 1
symmnumber: 1
zpe: 655334.5 jmol-1
zpe.correction: 0.249604 hartree
zpe.thermalcorrener: 0.270262 hartree
zpe.thermalcorrenthalpy: 0.271207 hartree
zpe.thermalcorrgfe: 0.197341 hartree
zpe.sumelectzpe: -1443.562621 hartree
zpe.sumelectthermal: -1443.541963 hartree
zpe.sumelectthermalent: -1443.541018 hartree
zpe.sumelectthermalfe: -1443.614884 hartree
dipole: 0.5649 -0.3326 -3.9912
dipole: 4.0446
quadrupole: -137.1114 -130.0767 -138.0463
quadrupole: -21.9259 4.1413 -4.4172
quadrupole: -2.0333 5.0015 -2.9682 -21.9259 4.1413 -4.4172
hfenergy: -1443.8122251 hartree
pointgroup: C01[X(C14H13N1O6S1)]
dipole: 0.3730182 0.0650788 1.5455798 debye
polarizability: 214.2941023|-12.2745139|256.4890288|-16.8165994|1.1510036|147.4869651 unknown
InChI: InChI=1S/C14H13NO6S/c16-15(17)12-5-4-8-14(11-12)22(18,19)21-10-9-20-13-6-2-1-3-7-13/h1-8,11H,9-10H2
charge 0 multiplicity 1
35 atoms
S  -1.372935 2.862218 -0.381825
O  0.284339 3.040821 0.498078
O  1.961805 0.734292 -0.453378
O  -1.081535 2.673292 -1.966571
O  -2.330839 4.031311 0.182162
O  -2.089399 -3.530997 0.182739
O  -0.890202 -2.404961 -1.396464
N  -1.646213 -2.445992 -0.352434
C  -1.954767 1.225716 0.344991
C  1.448391 3.100303 -0.410732
C  2.456413 2.037265 0.004626
C  -1.53657 0.044126 -0.278752
C  -2.811276 1.276483 1.457232
C  -2.035586 -1.153154 0.275252
C  -3.278381 0.050348 1.985731
C  -2.892563 -1.172173 1.397876
C  2.762705 -0.393637 -0.165807
C  3.979479 -0.339607 0.558735
C  2.273891 -1.62817 -0.658219
C  4.69909 -1.536517 0.787944
C  3.002556 -2.809905 -0.41917
C  4.219589 -2.773175 0.305595
H  1.125951 2.943185 -1.460256
H  1.88912 4.109987 -0.313377
H  3.435534 2.262119 -0.469916
H  2.581469 2.038711 1.105838
H  -0.868563 0.037979 -1.144933
H  -3.110139 2.240679 1.88068
H  -3.945747 0.053096 2.852329
H  -3.243772 -2.132575 1.784072
H  4.374827 0.605214 0.943198
H  1.337959 -1.650123 -1.224566
H  5.639877 -1.493615 1.348452
H  2.617033 -3.76075 -0.80281
H  4.783059 -3.69409 0.48778
