program: Gaussian 09
title: 000292313
version: EM64L-G09RevD.01
frameworkgroup: C1[X(C19H14Cl2N2)]
method: RPBEPBE
basis: SDD
operation: Freq
keyword: #p
keyword: freq=noraman
keyword: PBEPBE/SDD
title: #p freq=noraman PBEPBE/SDD
converged: YES YES NO NO
title: Mulliken charges:
elementType: Cl Cl N N C C C C C C C C C C C C C C C C C C C H H H H H H H H H H H H H H
charge: -0.063927 -0.070141 -0.465567 -0.129521 0.057298 0.235406 0.441383 -0.412318 -0.333372 0.289918 -0.443685 -0.304110 -0.221729 -0.226349 -0.228731 -0.185776 -0.210710 -0.392733 -0.325488 -0.118070 -0.192819 -0.195711 -0.125092 0.323550 0.258660 0.264910 0.225697 0.321367 0.233517 0.236625 0.236420 0.254509 0.254075 0.256829 0.251222 0.252879 0.251586
chargesum: 0.00000
title: Mulliken charges with hydrogens summed into heavy atoms:
elementType: Cl Cl N N C C C C C C C C C C C C C C C C C C C
charge: -0.063927 -0.070141 -0.142017 -0.129521 0.057298 0.235406 0.441383 -0.153658 -0.068462 0.289918 -0.217988 0.017257 0.011788 0.010276 0.007689 0.068733 0.043365 -0.135904 -0.074267 -0.118070 0.060060 0.055874 -0.125092
polarizability: 3.97688802e+02 -4.93215527e+00 2.60373584e+02 6.31082130e+00 -2.17914007e+01 1.38087826e+02
1716.lowfreq: -5.3891 -3.7951 -0.0010 0.0013 0.0013 5.7344 25.3620 28.9688 36.7514
frequency: 25.3121 28.9222 36.7064 45.0436 53.5385 59.0599 86.7577 105.4395 134.7737 165.0043 188.3433 215.7944 236.0235 251.6879 298.0573 305.3728 338.8975 376.1161 386.7894 403.4277 408.5859 412.6546 414.3191 462.9762 499.6701 512.3151 536.8401 581.6029 612.7162 616.3717 623.8099 625.2938 648.3968 666.9218 687.3236 702.5602 705.6189 707.5805 747.8677 774.4003 811.8655 813.4883 822.2287 831.8245 844.5611 858.6104 903.7882 934.9485 936.2448 940.2886 955.1874 981.4238 983.2668 988.6863 992.0692 992.3936 1003.7543 1025.0277 1069.2710 1070.6760 1079.9336 1084.6072 1101.7687 1111.1900 1175.0518 1176.0119 1180.0773 1191.4574 1225.8918 1244.8775 1285.7116 1292.3314 1311.4004 1319.2420 1346.9713 1371.3001 1378.2212 1401.2431 1402.7290 1433.6163 1466.6809 1477.9790 1480.6575 1514.1868 1566.4941 1583.6779 1591.0998 1595.3695 1604.2976 1609.9151 1618.9952 3116.8276 3121.5951 3134.8182 3145.5077 3146.2182 3150.0279 3157.7228 3163.1749 3168.4453 3170.7683 3171.2960 3173.0086 3191.2056 3532.4623
redmass: 10.1554 7.2295 4.0053 4.2104 4.8735 5.3042 7.4579 8.0182 6.1582 7.8246 9.3537 6.1215 6.5625 7.4719 5.2970 6.1609 5.4397 8.0598 5.7282 2.8571 5.8080 3.0522 3.5609 4.6805 3.0866 2.8692 4.7368 6.5457 5.6139 1.4477 6.2363 4.6897 6.7325 4.7976 5.8490 3.4481 2.2359 2.5476 5.9826 2.2448 1.4067 1.3103 2.0412 2.5557 1.3990 1.2465 6.6612 1.4185 1.3581 1.3308 1.3505 1.3142 1.4400 5.3419 3.8602 4.2509 1.3371 2.5438 2.8456 2.8388 2.4312 1.6627 1.3367 1.3753 1.1199 1.0546 1.1128 1.1170 2.9749 3.8946 1.2660 1.3360 2.3076 1.4371 5.1774 5.1019 7.7390 3.9839 4.2832 2.2359 2.4478 2.2397 2.4274 2.3026 7.5391 6.3469 6.4760 5.2194 6.0307 6.1084 6.0855 1.0901 1.0875 1.0870 1.0885 1.0918 1.0884 1.0961 1.0911 1.0964 1.1013 1.0951 1.0975 1.0954 1.0761
irintensity: 0.1501 0.1292 0.0315 0.0629 0.0462 0.2112 0.3714 0.1180 0.1676 1.3542 0.4871 0.3926 2.7839 1.5768 0.9348 0.3309 1.2458 21.9864 6.3022 0.3771 10.6419 0.0139 5.4281 8.4361 30.6641 19.6633 11.9951 12.8864 0.8832 33.7297 3.1359 4.2273 6.8001 27.0047 24.6714 2.4065 15.9394 34.2750 1.8915 50.9966 39.9286 5.8525 18.5594 59.0912 51.0650 0.6885 11.3070 3.8085 0.5800 0.8185 0.0387 1.8476 0.9030 1.8442 38.3513 27.6292 0.1302 11.4631 26.8475 80.3458 30.2498 5.9769 12.4851 24.4946 6.5790 0.1892 1.7850 1.9410 77.7976 13.6638 0.0943 6.8285 31.1341 4.6285 8.3744 150.9737 0.8193 2.4431 4.4771 7.4482 244.3676 37.3339 90.2918 701.7896 5.1469 63.0701 115.9851 17.2466 43.8136 0.8700 459.8015 14.4193 5.1408 0.6108 7.4478 12.6209 5.9017 24.2769 1.8437 8.9121 17.2385 3.9776 1.3055 16.1331 25.8053
temp: 298.150 k
press: 1.00000 atm
elementType: 17 17 7 7 6 6 6 6 6 6 6 6 6 6 6 6 6 6 6 6 6 6 6 1 1 1 1 1 1 1 1 1 1 1 1 1 1
symmnumber: 1
zpe: 725024.1 jmol-1
zpe.correction: 0.276147 hartree
zpe.thermalcorrener: 0.295912 hartree
zpe.thermalcorrenthalpy: 0.296856 hartree
zpe.thermalcorrgfe: 0.224701 hartree
zpe.sumelectzpe: -1760.467275 hartree
zpe.sumelectthermal: -1760.447510 hartree
zpe.sumelectthermalent: -1760.446566 hartree
zpe.sumelectthermalfe: -1760.518721 hartree
dipole: 0.2627 5.7427 0.2380
dipole: 5.7536
quadrupole: -170.1967 -133.4744 -144.4875
quadrupole: 2.0026 2.4882 -6.0915
quadrupole: -20.8105 15.9118 4.8987 2.0026 2.4882 -6.0915
hfenergy: -1760.7434221 hartree
pointgroup: C01 [X(C19H14Cl2N2)]
dipole: -0.2569637 2.2426055 0.1698408 debye
polarizability: 396.3008527|13.2476396|254.7725095|8.0960058|36.085243|145.0768504 unknown
InChI: InChI=1S/C19H14Cl2N2/c20-15-6-10-17(11-7-15)22-19(14-4-2-1-3-5-14)23-18-12-8-16(21)9-13-18/h1-13,22H
charge 0 multiplicity 1
37 atoms
Cl 6.852122 -1.64983 0.020191
Cl -5.415074 -3.554539 -0.107757
N  1.453175 1.103806 0.022888
N  -0.1110 -0.624067 -0.346955
C  0.13714 0.640508 -0.082539
C  -0.882397 1.740046 0.0839
C  2.684296 0.398141 0.005278
C  -0.772748 2.678754 1.144532
C  -1.960853 1.853683 -0.831858
C  -1.384864 -1.234342 -0.27723
C  3.873641 1.174222 0.111895
C  2.784583 -1.015793 -0.103579
C  -1.725569 3.712532 1.28623
C  -2.906581 2.890651 -0.692525
C  -2.79293 3.822951 0.366129
C  5.140003 0.558955 0.116706
C  4.054162 -1.63287 -0.094948
C  -1.756103 -2.125471 -1.323893
C  -2.260105 -1.092273 0.839819
C  5.214158 -0.844464 0.014577
C  -2.981334 -2.822273 -1.283869
C  -3.480045 -1.798058 0.895167
C  -3.830669 -2.645944 -0.173314
H  1.538186 2.121786 0.063851
H  0.035521 2.581309 1.879778
H  -2.051434 1.134191 -1.651846
H  3.812285 2.267171 0.192597
H  1.871412 -1.603688 -0.203864
H  -1.638374 4.423733 2.114917
H  -3.731803 2.971252 -1.408052
H  -3.531466 4.624729 0.474464
H  6.049774 1.160206 0.19886
H  4.131698 -2.721057 -0.176692
H  -1.070847 -2.261573 -2.16639
H  -1.975871 -0.440761 1.672507
H  -3.264902 -3.496638 -2.097344
H  -4.144684 -1.690083 1.757468
