program: Gaussian 09
title: 000292276
version: EM64L-G09RevD.01
frameworkgroup: C1[X(C13H15N3O3)]
method: RPBEPBE
basis: SDD
operation: Freq
keyword: #p
keyword: freq=noraman
keyword: PBEPBE/SDD
title: #p freq=noraman PBEPBE/SDD
converged: YES YES NO NO
title: Mulliken charges:
elementType: O O O N N N C C C C C C C C C C C C C H H H H H H H H H H H H H H H
charge: -0.343159 -0.277677 -0.489241 -0.207151 -0.660572 -0.106598 -0.361672 0.372527 0.376212 -0.162495 -0.403936 0.244663 -0.397271 -0.426663 0.311787 -0.249482 -0.234813 -0.248728 -0.665473 0.277136 0.271807 0.231896 0.234268 0.232247 0.226621 0.225852 0.350671 0.344018 0.223270 0.243339 0.223726 0.261200 0.212838 0.370852
chargesum: 0.00000
title: Mulliken charges with hydrogens summed into heavy atoms:
elementType: O O O N N N C C C C C C C C C C C C C
charge: -0.343159 -0.277677 -0.118388 -0.207151 0.034117 -0.106598 -0.084536 0.372527 0.376212 0.109312 -0.172040 0.244663 -0.163003 -0.194416 0.311787 -0.022860 -0.008961 0.217881 0.032291
polarizability: 2.56757970e+02 5.87912189e-01 1.37215918e+02 -5.55359642e+00 1.53156566e+01 1.44557859e+02
1716.lowfreq: -4.7057 -0.0006 -0.0003 0.0001 3.6653 7.8615 39.9364 48.1168 53.8078
frequency: 39.9142 48.1105 53.7921 67.4540 76.5793 96.9142 124.6904 129.7698 170.8019 212.0898 219.8396 240.7058 285.3717 305.8411 310.7035 335.6929 343.0592 351.7211 365.2544 405.4841 420.5717 488.6850 502.2141 518.0070 540.4246 545.8768 574.5584 617.2911 623.2904 641.5089 677.0263 698.7065 721.0409 749.5117 753.1771 786.0359 791.1616 803.7919 829.9351 838.1964 872.4290 882.8866 902.8228 933.0727 936.7245 949.7867 984.2275 991.5224 1034.3151 1040.3645 1073.7445 1095.0245 1101.5490 1126.1277 1153.2240 1173.8598 1206.4718 1222.7930 1235.6977 1254.1880 1272.7057 1279.6094 1282.1747 1299.7914 1342.6424 1361.7531 1370.4538 1383.8300 1391.3968 1410.8856 1447.3432 1455.5117 1462.9603 1482.1696 1493.6227 1578.5278 1582.3379 1616.1703 1629.9221 1639.5458 1647.9021 2990.6387 3033.7811 3039.2631 3081.3486 3096.3412 3119.7331 3120.1481 3125.2339 3141.8755 3159.8901 3162.7943 3196.6187 3511.3106 3606.1095 3666.6281
redmass: 4.2701 4.0880 3.5286 4.5937 5.7268 7.0918 4.0466 3.7756 3.5344 1.4410 4.1883 5.2697 5.2825 3.3336 4.0082 4.6858 1.4918 3.7208 2.9655 3.8108 3.2767 4.1968 3.7031 6.0093 1.2579 2.1213 3.0101 2.3186 4.6945 3.2548 8.0717 3.8400 3.5435 3.2806 1.3978 3.7600 1.7022 1.3309 4.1079 4.5934 1.7422 3.5311 4.4500 3.3435 1.3897 1.4753 1.3346 2.8405 2.5180 4.2770 1.5523 2.1625 2.1416 1.5922 1.6559 1.0610 1.7760 1.9281 2.0353 1.5450 2.1518 1.8370 1.1265 1.4999 1.4062 1.3536 3.5956 5.2478 1.2480 2.0976 2.4291 1.0949 1.0477 1.0525 2.9739 1.2940 5.1798 6.5125 6.2477 7.7934 6.7969 1.0364 1.0592 1.0838 1.0981 1.1024 1.0866 1.1061 1.0893 1.0939 1.0891 1.0999 1.0984 1.0442 1.0679 1.1055
irintensity: 0.0963 0.8042 0.0738 1.5664 0.2227 1.6253 3.1409 0.8646 1.7621 2.5709 0.0876 0.9624 1.1957 11.0470 1.6405 15.1005 103.0204 13.6272 61.0536 4.3391 10.8533 1.2000 4.1283 1.9196 180.1103 30.3581 12.6908 7.0761 32.7996 14.9447 15.5768 46.7661 11.4147 5.1812 24.0837 0.8102 82.2339 7.1123 31.5349 49.1289 20.8822 47.4703 13.9788 6.8189 6.0147 5.7646 0.2485 8.9587 42.1448 265.0523 79.6652 39.7193 18.5131 15.6861 37.4002 0.3281 15.5479 54.2466 87.0474 183.1856 95.4911 136.3017 1.3976 21.0114 37.8878 26.1239 19.3457 28.5485 32.1270 49.1661 29.2253 36.5463 18.9604 20.0493 8.4715 55.1026 14.7672 21.2556 69.9318 570.9308 62.8213 19.5540 31.2857 2.4890 40.2858 5.8468 3.8438 28.1009 2.6918 29.7744 18.9301 27.6542 6.4548 78.3147 44.1206 103.5208
temp: 298.150 k
press: 1.00000 atm
elementType: 8 8 8 7 7 7 6 6 6 6 6 6 6 6 6 6 6 6 6 1 1 1 1 1 1 1 1 1 1 1 1 1 1 1
symmnumber: 1
zpe: 699567.8 jmol-1
zpe.correction: 0.266451 hartree
zpe.thermalcorrener: 0.284342 hartree
zpe.thermalcorrenthalpy: 0.285286 hartree
zpe.thermalcorrgfe: 0.220282 hartree
zpe.sumelectzpe: -892.884020 hartree
zpe.sumelectthermal: -892.866129 hartree
zpe.sumelectthermalent: -892.865185 hartree
zpe.sumelectthermalfe: -892.930189 hartree
dipole: 1.3569 1.0790 1.8176
dipole: 2.5118
quadrupole: -92.4497 -113.4011 -104.6025
quadrupole: 6.3129 8.4309 -0.4475
quadrupole: 11.0347 -9.9167 -1.1180 6.3129 8.4309 -0.4475
hfenergy: -893.1504708 hartree
pointgroup: C01 [X(C13H15N3O3)]
dipole: -0.4978374 -0.6040752 0.6031822 debye
polarizability: 256.8454205|-3.3786242|146.1951472|-3.6177822|-14.6951523|135.4911796 unknown
InChI: InChI=1S/C13H15N3O3/c1-2-19-13(17)16-8-7-9-5-3-4-6-10(9)11(16)12(14)15-18/h3-8,11,18H,2,14H2,1H3
charge 0 multiplicity 1
34 atoms
O  -2.542565 -0.021323 1.191709
O  -2.769549 1.961834 -0.05588
O  0.303966 -3.250164 -2.025812
N  -0.757592 0.741896 -0.074966
N  -1.445237 -2.244075 -0.431863
N  0.802182 -2.066682 -1.253965
C  0.037624 -0.434074 0.421375
C  1.515121 -0.072795 0.545371
C  2.076222 0.900168 -0.330973
C  -0.171883 1.607932 -1.036668
C  1.181486 1.657545 -1.207728
C  -0.198983 -1.655458 -0.484429
C  2.334865 -0.743987 1.473321
C  3.472297 1.153655 -0.277419
C  -2.072973 0.983908 0.31385
C  3.72333 -0.481938 1.524695
C  4.292302 0.464209 0.639275
C  -3.909479 0.220682 1.752343
C  -4.995122 -0.300259 0.807758
H  -0.367367 -0.68732 1.416776
H  -0.88187 2.233966 -1.580222
H  1.599731 2.327873 -1.963908
H  1.895742 -1.494791 2.141463
H  3.907012 1.902189 -0.950759
H  4.35615 -1.01551 2.242014
H  5.368924 0.665617 0.670675
H  -2.173227 -1.843799 0.1582
H  -1.624523 -3.027978 -1.056518
H  -3.892438 -0.322339 2.711177
H  -4.02223 1.303912 1.929414
H  -5.988502 -0.158778 1.272799
H  -4.979945 0.254761 -0.14461
H  -4.868164 -1.37823 0.602336
H  1.102393 -3.489748 -2.557531
