program: Gaussian 09
title: 000292266
version: EM64L-G09RevD.01
frameworkgroup: C1[X(C12H18O3)]
method: RPBEPBE
basis: SDD
operation: Freq
keyword: #pfreq=noraman
keyword: PBEPBE/SDD
title: #p freq=noraman PBEPBE/SDD
converged: NO YES NO NO
title: Mulliken charges:
elementType: O O O C C C C C C C C C C C C H H H H H H H H H H H H H H H H H H
charge: -0.222388 -0.180869 -0.203750 -0.211876 0.349740 -0.074961 -0.527367 -0.106829 -0.567464 0.107361 -0.556244 -0.737995 -0.733958 -0.740096 0.184996 0.265251 0.244251 0.224844 0.238422 0.271650 0.245300 0.230352 0.240210 0.254081 0.219578 0.226473 0.221890 0.218289 0.216066 0.220966 0.224264 0.235095 0.224717
chargesum: 0.00000
title: Mulliken charges with hydrogens summed into heavy atoms:
elementType: O O O C C C C C C C C C C C C
charge: -0.222388 -0.180869 -0.203750 0.053375 0.349740 0.169289 -0.064101 0.164821 -0.091812 0.107361 -0.061954 -0.070054 -0.078637 -0.056020 0.184996
polarizability: 1.59028762e+02 -9.06122861e-01 1.29174580e+02 5.54958770e-01 4.04179913e+00 1.05664695e+02
1716.lowfreq: -23.4673 -2.8514 -0.0008 -0.0007 -0.0003 12.8431 40.6552 70.0607 96.1088
frequency: 40.2054 70.0569 96.0942 100.5454 169.5884 185.4829 198.3298 209.1068 230.8674 241.5260 267.0096 285.8779 324.1802 362.9506 374.9201 386.1673 398.7320 426.9873 445.4373 465.2384 486.5043 526.6612 564.7345 591.3436 630.2386 684.8975 745.9014 811.1042 825.7262 865.0803 882.5579 907.4138 914.2058 924.1989 936.8975 942.7446 956.6879 988.4460 995.7511 1016.3419 1040.2982 1064.2739 1087.8492 1116.0141 1125.9065 1157.3161 1166.0348 1177.3519 1199.8766 1217.6386 1225.1414 1246.9832 1254.0172 1271.0826 1283.0722 1292.4822 1306.7371 1324.7768 1337.9516 1349.9846 1358.5581 1380.8817 1393.2027 1401.1610 1440.8129 1456.8666 1457.4057 1465.3254 1472.5550 1473.0842 1481.2077 1483.0168 1488.3924 1629.4342 1678.7437 2947.4032 2970.8235 2973.8013 2975.1046 2977.5472 2985.1380 2987.1638 2994.0081 3013.5619 3056.7047 3066.7038 3069.1799 3069.4428 3071.7788 3073.3086 3076.7637 3079.0446 3090.0423
redmass: 4.1986 3.8788 5.0706 3.6910 3.5645 2.6359 2.4595 1.2296 1.1124 1.5687 1.7400 2.8231 3.4990 2.8083 3.5200 2.6954 2.6526 3.1248 2.8051 2.6549 3.5601 3.3814 4.1654 4.2311 4.0550 5.6690 3.7175 3.9450 2.4528 2.0924 1.8219 2.0876 2.0605 2.5613 1.5320 2.2784 3.5893 1.6872 1.5288 1.8786 2.2085 1.6160 1.7445 2.0063 2.4167 3.0060 2.1962 1.9825 1.5690 1.7724 1.6365 1.7332 1.4873 1.5986 1.5013 1.6786 1.4589 1.4494 1.3525 1.4186 1.5327 1.2013 1.2085 1.2004 1.0896 1.0788 1.0777 1.0503 1.0548 1.0624 1.0441 1.0581 1.0558 9.8408 11.4518 1.0801 1.0356 1.0554 1.0366 1.0458 1.0695 1.0725 1.0685 1.0838 1.1015 1.0994 1.0997 1.0992 1.0994 1.0987 1.0986 1.0995 1.0951
irintensity: 3.5383 1.0987 5.3405 0.5406 2.0135 3.5272 2.7160 0.8822 0.5223 2.5854 1.1883 0.6161 1.7120 0.1742 0.5693 1.7704 2.8889 1.5317 0.2018 2.7721 5.2506 3.5697 4.5809 7.3627 6.7243 2.1229 3.9410 5.1913 17.4735 4.2399 9.1920 1.4260 1.8303 7.5949 6.2410 30.3319 81.6516 15.7608 11.6831 4.7998 125.2881 1.0481 0.2119 30.4707 1.5160 139.4001 10.5983 12.9780 25.9010 5.8350 44.3400 9.7209 7.3091 14.2437 27.2647 4.0513 23.2088 12.5187 2.5004 0.9427 34.0280 20.8953 13.6963 16.0434 9.6672 9.3700 13.5665 2.3462 3.5947 13.9894 16.3945 9.7719 14.9400 142.1724 328.5509 3.6251 30.2122 20.2378 25.9407 6.3767 1.7940 16.5403 34.1377 12.1202 11.9655 10.8634 7.1175 15.8909 29.5922 68.5501 62.3130 23.9763 18.2756
temp: 298.150 k
press: 1.00000 atm
elementType: 8 8 8 6 6 6 6 6 6 6 6 6 6 6 6 1 1 1 1 1 1 1 1 1 1 1 1 1 1 1 1 1 1
symmnumber: 1
zpe: 731275.4 jmol-1
zpe.correction: 0.278528 hartree
zpe.thermalcorrener: 0.293449 hartree
zpe.thermalcorrenthalpy: 0.294393 hartree
zpe.thermalcorrgfe: 0.237399 hartree
zpe.sumelectzpe: -692.590513 hartree
zpe.sumelectthermal: -692.575592 hartree
zpe.sumelectthermalent: -692.574648 hartree
zpe.sumelectthermalfe: -692.631641 hartree
dipole: -3.7699 1.0678 0.3789
dipole: 3.9365
quadrupole: -95.7501 -108.0478 -86.8921
quadrupole: 15.9181 5.4348 -5.9096
quadrupole: 1.1465 -11.1511 10.0046 15.9181 5.4348 -5.9096
hfenergy: -692.8690406 hartree
pointgroup: C01 [X(C12H18O3)]
dipole: 1.5023012 -0.3354962 0.1706842 debye
polarizability: 159.0411559|0.7484803|128.9599455|0.1324894|-4.6074408|105.8669367 unknown
InChI: InChI=1S/C12H18O3/c1-7-4-10(14)15-9-6-12(2,3)5-8(13)11(7)9/h7,9,11H,4-6H2,1-3H3
charge 0 multiplicity 1
33 atoms
O  -1.245616 1.634373 -0.201579
O  0.937083 -2.575242 0.580557
O  -3.533097 1.765676 -0.304054
C  -0.315428 -0.64711 -0.286659
C  2.454575 0.597807 -0.038802
C  -0.09287 0.79176 0.24634
C  1.172899 1.442139 -0.316589
C  -1.618197 -1.281862 0.27142
C  2.237301 -0.857823 -0.582009
C  0.955628 -1.480625 -0.041074
C  -2.55062 -0.178662 0.868284
C  2.769492 0.542844 1.481027
C  3.650669 1.239747 -0.783548
C  -2.339896 -2.10786 -0.817034
C  -2.537089 1.126703 0.079897
H  -0.403972 -0.529689 -1.389483
H  -0.082185 0.79396 1.354921
H  1.037639 1.564654 -1.409445
H  1.287954 2.455221 0.11139
H  -1.330457 -1.971342 1.087581
H  3.092389 -1.504153 -0.317405
H  2.167326 -0.811731 -1.688673
H  -2.227241 0.055854 1.902747
H  -3.593495 -0.529586 0.925396
H  2.856258 1.563374 1.897951
H  1.995432 0.002784 2.056234
H  3.727777 0.021144 1.658767
H  4.572716 0.64775 -0.634765
H  3.458402 1.306255 -1.870788
H  3.841948 2.262966 -0.409766
H  -2.69338 -1.462409 -1.643681
H  -1.66199 -2.871568 -1.239547
H  -3.217156 -2.634445 -0.399812
