program: Gaussian 09
title: 000292275
version: EM64L-G09RevD.01
frameworkgroup: C1[X(C11H14N2O4)]
method: RPBEPBE
basis: SDD
operation: Freq
keyword: #p
keyword: freq=noraman
keyword: PBEPBE/SDD
title: #p freq=noraman PBEPBE/SDD
converged: YES YES NO NO
title: Mulliken charges:
elementType: O O O O N N C C C C C C C C C C C H H H H H H H H H H H H H H
charge: -0.319320 -0.242812 -0.211994 -0.225958 -0.443197 0.015956 -0.523531 -0.347449 0.310824 0.215979 0.199948 -0.282691 -0.681192 -0.481929 0.418615 -0.396609 -0.524660 0.236994 0.212376 0.207275 0.244129 0.348534 0.319902 0.211047 0.226221 0.207273 0.299415 0.287479 0.246397 0.236472 0.236505
chargesum: 0.00000
title: Mulliken charges with hydrogens summed into heavy atoms:
elementType: O O O O N N C C C C C C C C C C C
charge: -0.319320 -0.242812 -0.211994 -0.225958 -0.094663 0.015956 -0.074160 0.103955 0.310824 0.215979 0.199948 0.037210 -0.036651 -0.182514 0.418615 -0.109130 0.194715
polarizability: 2.70540351e+02 4.55404819e+00 1.65036596e+02 -6.08520685e+00 3.91598392e-01 7.85919598e+01
1716.lowfreq: -8.6873 -4.2433 -0.0004 0.0006 0.0008 3.0618 20.2797 44.6657 58.7676
frequency: 19.8157 44.6592 58.7651 62.6097 69.3558 102.1298 115.4205 148.0795 154.9728 181.6988 200.6849 222.6299 232.9701 249.7681 272.5820 310.8695 345.1785 357.6680 406.8509 463.4605 481.2269 502.8333 544.8995 557.6547 602.1942 636.3493 697.3600 728.9571 732.9040 736.9958 744.5732 765.3026 810.5511 865.0981 872.8063 885.0981 894.8944 896.4523 948.8908 999.8915 1000.5971 1058.4960 1079.8150 1086.0159 1104.3981 1118.0189 1121.6062 1155.5640 1174.7958 1197.1390 1211.1288 1231.2980 1252.8146 1277.9955 1296.0591 1313.0646 1348.5336 1356.0848 1393.6555 1396.2536 1427.2307 1445.6264 1448.4340 1466.3926 1469.3037 1476.1330 1478.9336 1484.1972 1486.4570 1513.9370 1597.2991 1605.1533 1627.0204 2971.2043 2974.4550 2976.7639 2996.0608 3024.9200 3051.0611 3071.3000 3078.1110 3078.5867 3136.6856 3184.0799 3189.8135 3202.3726 3495.0460
redmass: 3.3968 3.1064 11.3194 2.2946 5.9391 3.6737 4.1848 5.3663 3.9845 2.0782 2.4467 5.4870 1.1573 1.9876 4.9724 5.6182 3.9301 4.9713 5.0775 3.4471 7.1605 6.4752 4.4661 4.8914 4.0521 6.6832 6.5660 3.6052 1.5212 9.6662 1.3849 2.0614 3.7324 1.3958 1.5736 4.0448 1.4736 2.2039 4.4253 6.1903 1.3197 2.5818 2.0403 1.6247 2.2438 1.2568 1.6936 1.3646 2.5906 2.4732 5.4306 1.3863 1.6758 1.2318 1.8227 1.4632 1.5917 7.3881 1.2446 3.5521 2.7620 1.1294 1.6039 1.0514 1.3216 1.0472 1.0452 1.6946 1.0816 3.0479 8.0634 6.0340 5.3198 1.0580 1.0371 1.0321 1.0637 1.0982 1.1001 1.1049 1.0987 1.1022 1.1011 1.0903 1.0913 1.0964 1.0762
irintensity: 0.0289 0.1137 2.4037 0.0410 0.6263 3.5543 8.7535 2.3915 4.0286 4.3599 1.0571 0.1238 0.0719 1.1504 9.9227 1.2248 0.6682 1.2534 1.8036 5.3280 1.4963 4.8577 6.5056 2.4325 2.2347 5.1391 26.0713 10.2229 24.9373 24.1762 6.0546 43.3768 4.9460 18.0753 0.8460 1.5116 63.5019 20.6177 2.9460 67.9229 1.0735 9.1233 4.3473 67.6410 11.6083 0.0976 42.1144 6.5427 311.8958 71.6118 498.7417 3.0887 109.7211 17.2563 48.4793 63.9882 6.8167 74.5350 27.9705 309.8088 29.2503 15.8558 26.0751 16.7307 97.6756 8.5613 12.6058 70.2473 17.0162 503.0270 207.8698 37.8150 58.4241 11.8705 41.7863 46.1918 25.1422 12.7528 0.3919 32.5530 46.3310 68.8836 15.6085 2.0068 5.1968 4.5544 52.0657
temp: 298.150 k
press: 1.00000 atm
elementType: 8 8 8 8 7 7 6 6 6 6 6 6 6 6 6 6 6 1 1 1 1 1 1 1 1 1 1 1 1 1 1
symmnumber: 1
zpe: 634349.9 jmol-1
zpe.correction: 0.241611 hartree
zpe.thermalcorrener: 0.258743 hartree
zpe.thermalcorrenthalpy: 0.259687 hartree
zpe.thermalcorrgfe: 0.194802 hartree
zpe.sumelectzpe: -836.625575 hartree
zpe.sumelectthermal: -836.608443 hartree
zpe.sumelectthermalent: -836.607499 hartree
zpe.sumelectthermalfe: -836.672384 hartree
dipole: 5.5276 5.8806 -0.1637
dipole: 8.0723
quadrupole: -124.2324 -92.9311 -100.1911
quadrupole: -3.3392 0.9831 -0.3557
quadrupole: -18.4475 12.8538 5.5938 -3.3392 0.9831 -0.3557
hfenergy: -836.8671864 hartree
pointgroup: C01 [X(C11H14N2O4)]
dipole: 2.2698508 -2.2072598 -0.2489934 debye
polarizability: 270.0200924|-2.3051395|161.8845064|12.9839155|15.6372804|82.2643084 unknown
InChI: InChI=1S/C11H14N2O4/c1-3-4-11(14)12-9-6-5-8(13(15)16)7-10(9)17-2/h5-7,12H,3-4H2,1-2H3
charge 0 multiplicity 1
31 atoms
O  0.033196 -2.300965 -0.421933
O  2.491412 1.841826 0.625367
O  -4.515357 1.733141 -0.030021
O  -4.748057 -0.490883 -0.49225
N  1.591307 -0.265495 0.125476
N  -4.026385 0.551233 -0.220164
C  4.028253 -0.065182 0.452827
C  5.113254 0.776756 -0.262321
C  0.215756 0.025622 0.057641
C  2.653332 0.606109 0.407843
C  -0.64583 -1.085298 -0.241181
C  -0.35397 1.30816 0.259855
C  6.527499 0.197054 -0.056756
C  -2.033136 -0.919788 -0.332881
C  -2.566214 0.375166 -0.123046
C  -1.747959 1.484716 0.170202
C  -0.767675 -3.491996 -0.730687
H  4.309392 -0.170857 1.520722
H  3.99155 -1.08798 0.028753
H  4.88071 0.832872 -1.343545
H  5.059083 1.809894 0.12586
H  1.816412 -1.250403 -0.050572
H  0.310399 2.143934 0.483498
H  6.7939 0.170943 1.016811
H  7.285079 0.810928 -0.576238
H  6.605095 -0.834883 -0.448685
H  -2.71871 -1.739482 -0.557911
H  -2.206421 2.464552 0.322663
H  -0.042278 -4.312049 -0.828968
H  -1.318624 -3.358956 -1.680311
H  -1.476911 -3.711289 0.08895
