program: Gaussian 09
title: 000292251
version: EM64L-G09RevD.01
frameworkgroup: C1[X(C5H2Br2O2)]
method: RPBEPBE
basis: SDD
operation: Freq
keyword: #p
keyword: freq=noraman
keyword: PBEPBE/SDD
title: #p freq=noraman PBEPBE/SDD
converged: NO YES NO YES
title: Mulliken charges:
elementType: Br Br O O C C C C C H H
charge: 0.098328 0.098328 -0.186628 -0.181464 0.441902 -0.293762 -0.293762 -0.126294 -0.126294 0.284823 0.284823
chargesum: 0.00000
title: Mulliken charges with hydrogens summed into heavy atoms:
elementType: Br Br O O C C C C C
charge: 0.098328 0.098328 -0.186628 -0.181464 0.441902 -0.293762 -0.293762 0.158529 0.158528
polarizability: 1.35490361e+02 -5.89654583e-04 9.92029933e+01 1.18417725e-03 3.74294187e-05 3.10658595e+01
1716.lowfreq: -2.2626 -0.0001 0.0002 0.0003 5.4688 6.9041 63.6718 122.7089 200.3868
frequency: 63.6717 122.7089 200.3866 221.5195 249.9291 252.4251 314.2848 446.2562 466.4821 524.6125 543.2487 712.8449 765.3112 810.5189 849.3094 853.7753 941.7049 1053.1600 1056.0597 1251.3440 1313.9445 1321.5114 1540.4574 1565.8876 1601.0137 3219.1721 3223.8910
redmass: 18.5254 27.6223 4.3227 12.9021 21.3961 10.9303 10.4936 4.8008 3.9997 14.5911 8.0580 10.3567 12.1606 6.2751 1.4085 1.3279 8.3580 5.8053 5.2253 5.1037 1.3345 1.4857 8.0500 8.6747 9.0008 1.0947 1.0986
irintensity: 2.6925 0.0941 0.0000 0.7248 0.1017 0.4190 1.8229 0.0000 10.6827 0.2007 8.6468 69.5297 16.7554 7.7327 0.0000 52.7665 90.0928 108.3851 16.7913 27.8695 14.1715 12.1144 2.4488 35.2847 161.2626 0.3311 1.2632
temp: 298.150 k
press: 1.00000 atm
elementType: 35 35 8 8 6 6 6 6 6 1 1
symmnumber: 1
zpe: 152436.7 jmol-1
zpe.correction: 0.058060 hartree
zpe.thermalcorrener: 0.066322 hartree
zpe.thermalcorrenthalpy: 0.067266 hartree
zpe.thermalcorrgfe: 0.022268 hartree
zpe.sumelectzpe: -368.405032 hartree
zpe.sumelectthermal: -368.396770 hartree
zpe.sumelectthermalent: -368.395826 hartree
zpe.sumelectthermalfe: -368.440824 hartree
dipole: 0.0000 4.6173 -0.0001
dipole: 4.6173
quadrupole: -62.7034 -70.4744 -70.4778
quadrupole: 0.0000 0.0000 0.0004
quadrupole: 5.1818 -2.5892 -2.5926 0.0000 0.0000 0.0004
hfenergy: -368.4630921 hartree
pointgroup: C01 [X(C5H2Br2O2)]
dipole: -0.0000203 -1.8165779 -0.0004628 debye
dipolederiv: -0.5395044 0.1933181 0.000064 0.216132 -0.0479295 -0.000022 0.0000602 -0.0000211 0.0384175 -0.5394967 -0.193419 -0.0000267 -0.2161362 -0.0477435 -0.0000123 -0.0000455 -0.000012 0.0384169 -1.0386856 0.0000407 0.0000342 -0.0000653 -0.7974075 -0.0001511 0.0000646 -0.0002019 -0.0949984 -0.266929 -0.0000224 -0.0000019 -0.0001492 -0.9407823 -0.0001005 -0.0000496 -0.000223 -0.318755 0.0796628 0.0000902 0.0000122 0.0000892 1.1012886 0.0001577 0.0000745 0.0002423 0.29349 0.7196173 -0.663623 -0.0001818 -0.4488355 -0.2003989 0.0000107 -0.0000708 0.0000281 -0.1819647 0.7194848 0.663695 0.0001241 0.4488142 -0.2006631 -0.0000073 0.0000959 -0.0000218 -0.181964 0.4076086 -0.1593731 -0.0000514 -0.2092048 0.4790775 0.0000912 -0.0000804 0.0000861 0.0170827 0.4077172 0.1593638 0.0000233 0.2093553 0.4790914 0.0000742 -0.00005 0.0000896 0.0170824 0.0252645 -0.0139901 0.0000019 -0.0251762 0.0877142 -0.0000226 -0.0000153 0.000013 0.1865963 0.0252605 0.0139199 0.0000021 0.0251765 0.0877531 -0.000018 0.0000164 0.0000206 0.1865962 unknown
polarizability: 135.4903608|-0.0009718|99.2029897|-0.0041262|0.0156824|31.0658632 unknown
InChI: InChI=1S/C5H2Br2O2/c6-3-1-9-2-4(7)5(3)8/h1-2H
charge 0 multiplicity 1
11 atoms
Br -2.940693 0.917667 0.000267
Br 2.940683 0.917605 0.000102
O  -0.000036 -2.071555 -0.000483
O  0.000008 2.116177 0.000525
C  -0.000006 0.854118 0.000067
C  -1.229085 0.014355 -0.00002
C  1.229056 0.014329 -0.000093
C  -1.197452 -1.356407 -0.0003
C  1.197394 -1.356432 -0.000372
H  -2.062677 -2.019257 -0.000385
H  2.062605 -2.0193 -0.000507
