program: Gaussian 09
title: 000292255
version: EM64L-G09RevD.01
frameworkgroup: C1[X(C6H12N2)]
method: RPBEPBE
basis: SDD
operation: Freq
keyword: #pfreq=noraman
keyword: PBEPBE/SDD
title: #p freq=noraman PBEPBE/SDD
converged: YES YES NO NO
title: Mulliken charges:
elementType: N N C C C C C C H H H H H H H H H H H H
charge: -0.073937 -0.386927 -0.400180 -0.395063 -0.521216 -0.478174 0.194504 -0.603138 0.214809 0.207104 0.201517 0.202947 0.232343 0.213944 0.215675 0.202395 0.292743 0.251447 0.195802 0.233405
chargesum: 0.00000
title: Mulliken charges with hydrogens summed into heavy atoms:
elementType: N N C C C C C C
charge: -0.073937 -0.094185 0.021734 0.009401 -0.074929 -0.060104 0.194504 0.077516
polarizability: 9.47474873e+01 -6.85249939e+00 7.99446636e+01 2.06041390e-02 -1.21774037e+00 5.67458686e+01
1716.lowfreq: -14.2911 -8.9063 -0.0003 -0.0002 0.0006 11.8522 64.8920 85.3659 169.2390
frequency: 64.8602 85.3206 169.2295 206.2033 228.3260 289.5224 331.8193 393.2038 451.5547 505.2401 552.8786 656.9530 752.1807 823.3962 861.5359 906.7663 921.2119 945.2410 1050.4699 1076.3952 1089.7514 1094.7097 1124.1195 1146.5739 1167.5283 1180.8670 1241.5410 1248.4975 1280.7999 1327.5961 1334.6705 1339.6106 1351.0634 1426.9972 1446.2190 1447.5385 1460.7481 1462.7010 1473.6235 1480.9932 1508.2923 1643.0797 2948.6055 2967.3776 2970.1577 2974.2937 2983.0138 3007.9116 3021.0504 3040.5321 3049.3560 3051.4927 3093.4293 3596.8007
redmass: 1.0612 2.3372 2.7436 2.8692 3.0521 1.6253 1.1385 3.6772 2.6690 2.7465 3.6298 2.2868 3.5496 1.5186 2.5627 1.6239 2.0580 2.7422 2.4007 2.3922 1.7373 1.8457 1.2895 1.2586 1.4962 2.2166 1.4708 1.2701 1.3649 1.2721 1.4685 1.5192 1.5545 1.1798 1.0757 1.0825 1.0895 1.0879 1.1077 1.4234 1.2804 6.2895 1.0662 1.0579 1.0381 1.0637 1.0639 1.0934 1.0993 1.0992 1.0962 1.1041 1.1015 1.0781
irintensity: 0.8194 1.8701 18.6568 3.5816 0.5518 27.0632 86.7891 2.7342 3.0118 2.8201 1.0940 4.0350 1.4160 4.9198 4.0764 1.7471 18.1475 3.6659 4.1704 5.3002 2.9169 3.5190 5.9378 2.3339 1.4047 14.3576 4.0775 9.6159 5.0608 15.3916 3.4666 24.7051 8.6254 15.8451 26.1203 5.3449 13.7832 4.2711 2.9470 57.4322 120.5317 237.0729 73.4857 39.6867 74.7959 21.1635 30.3102 65.5601 26.3823 58.8316 25.8220 88.4823 27.5323 25.3081
temp: 298.150 k
press: 1.00000 atm
elementType: 7 7 6 6 6 6 6 6 1 1 1 1 1 1 1 1 1 1 1 1
symmnumber: 1
zpe: 462080.6 jmol-1
zpe.correction: 0.175997 hartree
zpe.thermalcorrener: 0.184702 hartree
zpe.thermalcorrenthalpy: 0.185646 hartree
zpe.thermalcorrgfe: 0.142570 hartree
zpe.sumelectzpe: -344.685094 hartree
zpe.sumelectthermal: -344.676390 hartree
zpe.sumelectthermalent: -344.675446 hartree
zpe.sumelectthermalfe: -344.718522 hartree
dipole: -0.0093 2.5590 -0.0984
dipole: 2.5609
quadrupole: -43.5279 -48.8884 -50.5064
quadrupole: -3.6454 0.1310 0.2495
quadrupole: 4.1130 -1.2475 -2.8655 -3.6454 0.1310 0.2495
hfenergy: -344.8610916 hartree
pointgroup: C01 [X(C6H12N2)]
dipole: -0.0101367 1.0064741 -0.044906 debye
dipolederiv: -0.7156104 -0.0020407 0.0345259 0.5824605 -0.8313031 0.050771 0.0147785 0.0105373 -0.3534495 -1.2707733 0.2451054 -0.0171683 0.1208394 -0.4520198 0.0486101 -0.1085938 0.0793516 -0.5317999 0.0960341 0.0409936 -0.0208809 0.0302781 0.0253506 -0.0265674 0.0241432 -0.0268359 0.1355633 -0.0793577 -0.0073934 0.0566971 -0.0307056 -0.0519702 -0.0059297 0.0261759 -0.0053658 0.1335525 -0.1193427 -0.0385197 -0.0239588 -0.1220392 -0.0747787 0.0406581 0.0131069 0.0866835 0.2136304 0.527728 -0.1628443 0.0021147 -0.1456071 0.3446226 -0.0166955 -0.0185925 0.0034311 0.2575538 1.3293212 -0.362878 0.0088178 -0.6108083 0.8162497 -0.0845097 -0.0120647 -0.0928341 0.0799944 0.4009612 0.0680646 -0.0235399 0.2319667 0.2637451 -0.0540707 0.0096686 -0.0498026 0.2594988 -0.0778283 -0.1340932 0.0219613 -0.1430669 -0.0916892 0.0226465 0.0415855 0.0453131 0.0697892 0.0506487 0.0233446 0.0066181 0.0452704 0.0590197 0.0369119 -0.0431018 -0.0135112 -0.1844558 0.0844575 -0.0039842 -0.0369432 -0.0287761 0.0289491 0.0385183 0.033052 0.0122605 -0.1904214 -0.2290123 0.0945792 -0.0254938 0.0652525 0.0381527 0.0101076 -0.0548638 0.0098161 0.0751152 0.0258224 -0.0332649 -0.0067364 -0.0103257 0.0211879 0.0385939 -0.0166922 0.1002573 -0.1222036 -0.005663 0.0958431 0.0652603 0.074978 -0.1044568 -0.07611 0.0488779 -0.1284268 0.0276685 -0.0159857 0.0392186 0.00743 0.0488567 -0.1443328 -0.1007292 0.0694591 -0.1575742 0.0088791 -0.0881186 0.0883909 -0.0511722 0.0121842 0.0436895 0.0560795 -0.1033749 0.1384432 -0.1528045 0.142376 -0.0398144 0.0012746 -0.0536179 0.0824456 -0.0071656 0.0350293 -0.0471457 0.3254109 0.0891834 0.0355614 0.0470994 -0.0851291 -0.0189097 -0.0993778 -0.0059392 -0.1002942 -0.0240622 -0.1639727 0.0605146 -0.0376194 0.1481537 0.0209627 0.0384645 -0.0452771 0.0361391 0.1042704 0.0191324 -0.006783 -0.0082864 -0.1301642 0.0250852 0.0897942 0.0926231 0.0995575 -0.1317296 unknown
polarizability: 94.8281067|-6.7739178|79.8462075|-0.265569|-1.3021969|56.7637054 unknown
InChI: InChI=1S/C6H12N2/c1-7-6-4-2-3-5-8-6/h7H,2-5H2,1H3
charge 0 multiplicity 1
20 atoms
N  -0.242895 -1.031245 0.093935
N  -1.902602 0.60438 -0.041022
C  1.844175 0.998353 0.306347
C  2.194212 -0.353089 -0.354704
C  0.421042 1.418218 -0.125035
C  1.182378 -1.434615 0.099496
C  -0.558061 0.239944 -0.007881
C  -2.975772 -0.389048 0.032897
H  2.573716 1.781677 0.029041
H  1.88274 0.887997 1.408431
H  2.150688 -0.238081 -1.45689
H  3.222965 -0.669407 -0.09701
H  0.43616 1.766156 -1.177838
H  0.060699 2.268335 0.488123
H  1.276532 -2.334713 -0.538842
H  1.434954 -1.764444 1.130376
H  -2.134422 1.595241 -0.015878
H  -2.800795 -1.188051 -0.708929
H  -3.942825 0.101528 -0.173967
H  -3.017889 -0.876734 1.02655
