program: Gaussian 09
title: 000292248
version: EM64L-G09RevD.01
frameworkgroup: C1[X(C8H11NO)]
method: RPBEPBE
basis: SDD
operation: Freq
keyword: #p
keyword: freq=noraman
keyword: PBEPBE/SDD
title: #p freq=noraman PBEPBE/SDD
converged: YES YES NO NO
title: Mulliken charges:
elementType: O N C C C C C C C C H H H H H H H H H H H
charge: -0.293623 -0.189330 0.360288 0.360294 -0.449369 -0.449361 -0.649546 0.218117 -0.803081 -0.803124 0.246290 0.246288 0.253437 0.253463 0.245039 0.235082 0.236802 0.255219 0.235081 0.255225 0.236810
chargesum: 0.00000
title: Mulliken charges with hydrogens summed into heavy atoms:
elementType: O N C C C C C C C C
charge: -0.293623 -0.189330 0.360288 0.360294 -0.203079 -0.203074 0.102393 0.218117 -0.075978 -0.076008
polarizability: 1.32445106e+02 4.15954912e-04 1.04027631e+02 -5.05956671e-01 7.46815324e-05 5.39732060e+01
1716.lowfreq: -5.4568 -0.0003 0.0005 0.0009 9.2125 12.3496 72.2508 81.4961 161.0050
frequency: 72.0606 81.4905 161.0048 194.7073 244.7537 252.2160 262.6145 326.0356 328.6368 408.5944 448.1736 508.0183 527.4570 560.2435 574.7601 579.4350 694.6759 736.0198 854.1716 870.7574 914.7371 930.2005 1022.6635 1026.2292 1047.3044 1047.8744 1108.7019 1112.2673 1191.6186 1201.2189 1232.2837 1278.8815 1354.9445 1403.1289 1404.4822 1418.0921 1448.0572 1461.3666 1463.7564 1475.0426 1476.5565 1498.3736 1501.2192 1547.4778 1572.3451 1657.1199 2975.5828 2976.2913 2984.3813 3051.0612 3051.5714 3096.2905 3110.5278 3111.5871 3137.2386 3164.4210 3166.5786
redmass: 1.0683 2.9307 3.9654 2.5000 1.3420 1.1277 2.3138 2.6186 4.8700 2.3977 6.6306 4.8005 3.3955 3.1763 4.5362 4.2714 2.5284 3.8688 1.2268 1.7885 3.1779 2.9328 1.3433 1.4730 1.5138 1.5159 1.3225 1.9572 6.8207 2.0235 1.4386 3.5516 2.6149 1.2286 1.3011 3.5952 1.1244 1.1236 1.0661 1.1539 1.0566 1.1050 1.0818 6.2910 6.0434 7.0180 1.0401 1.0400 1.0472 1.0974 1.0973 1.0870 1.0964 1.0959 1.1003 1.0923 1.0928
irintensity: 0.0045 0.6431 0.1110 0.0001 3.7620 0.0327 7.1596 1.0597 4.5914 0.5334 10.8283 0.5477 0.0876 2.2142 0.3814 0.0895 3.0633 1.7386 0.0214 47.8968 4.6450 5.9003 9.6212 0.1445 0.0907 12.1702 12.5863 12.3019 29.9461 9.0734 0.0777 4.4562 53.3665 8.7162 1.8006 117.7687 11.8277 12.2282 19.9083 0.0296 32.2326 16.8053 14.3424 128.7947 15.8805 339.8167 18.3710 27.8245 67.1224 0.1863 37.6430 17.5478 12.4150 16.8347 7.1798 11.4167 0.3843
temp: 298.150 k
press: 1.00000 atm
elementType: 8 7 6 6 6 6 6 6 6 6 1 1 1 1 1 1 1 1 1 1 1
symmnumber: 1
zpe: 456419.0 jmol-1
zpe.correction: 0.173841 hartree
zpe.thermalcorrener: 0.183920 hartree
zpe.thermalcorrenthalpy: 0.184864 hartree
zpe.thermalcorrgfe: 0.138742 hartree
zpe.sumelectzpe: -440.667772 hartree
zpe.sumelectthermal: -440.657693 hartree
zpe.sumelectthermalent: -440.656749 hartree
zpe.sumelectthermalfe: -440.702871 hartree
dipole: -8.4727 0.0002 0.0186
dipole: 8.4727
quadrupole: -73.2912 -50.0802 -61.7357
quadrupole: 0.0004 -0.0007 0.0002
quadrupole: -11.5888 11.6221 -0.0333 0.0004 -0.0007 0.0002
hfenergy: -440.841613 hartree
pointgroup: C01 [X(C8H11N1O1)]
dipole: -3.3333894 0.0023471 -0.0153042 debye
dipolederiv: -1.3825062 0.0006441 -0.0037771 0.0006346 -0.4723974 -0.0000941 0.0033425 -0.0000963 -0.4028727 -0.9356362 0.0001971 -0.031087 -0.0001398 -0.7744873 -0.0008699 0.1571941 -0.0010096 -0.1203561 0.7051546 0.102244 -0.0031179 0.2828834 0.555467 -0.0031752 -0.0504319 0.0141209 -0.0089405 0.7046353 -0.1024757 -0.0033658 -0.2829944 0.5560511 0.0047267 -0.0511746 -0.012474 -0.0089811 -0.6127453 0.1497034 -0.002826 0.4450774 -0.2086216 0.0008822 -0.0073325 0.0032061 -0.2199167 -0.6135936 -0.1491167 -0.0032492 -0.4444994 -0.2077776 -0.0008425 -0.008562 -0.0031499 -0.2199286 0.5571195 -0.0005128 0.0791792 -0.0003929 0.0689561 -0.0002727 0.0169012 -0.000225 0.2185202 1.5164991 -0.0006603 0.0019273 -0.0006612 0.5807497 0.0005404 0.0056489 0.0005324 0.1847914 -0.0020272 0.1023923 -0.0013384 0.0327162 -0.126549 -0.001883 0.0193934 -0.0142823 0.0886077 -0.002179 -0.102547 -0.0016215 -0.0329092 -0.1264172 0.0012921 0.0192801 0.0136434 0.0886563 0.063862 -0.0491575 -0.0003368 -0.0382636 -0.068463 0.0021853 -0.0000631 0.0005098 0.157461 0.063983 0.0489717 -0.0002023 0.0380797 -0.0685798 -0.0028057 0.000047 -0.0011365 0.1574539 0.032563 0.044703 -0.0014392 0.1256865 -0.0152115 -0.0908242 0.0233729 -0.0807204 0.0553057 0.0324328 -0.0447664 -0.0014572 -0.1258255 -0.0155355 0.0905515 0.0230677 0.0804074 0.0559249 -0.0931033 0.0002193 -0.0404942 0.0004365 0.105685 0.0004117 -0.153858 0.0004911 -0.1091248 -0.0016139 0.0699216 0.1022923 0.0414431 0.0576637 0.0157738 0.1214851 -0.0293869 -0.0506579 -0.02712 0.0608173 -0.1100324 0.0222135 0.0609028 -0.0314453 -0.1283868 0.0184034 -0.0252461 0.0115122 -0.1569576 0.0143067 -0.050108 -0.0099929 0.011833 0.0085048 0.0157743 0.1176053 -0.0018097 -0.0701195 0.1020879 -0.0416833 0.0577791 -0.0156184 0.1214295 0.0295025 -0.0505967 0.0117945 0.1569 0.0147011 0.0500577 -0.0101909 -0.0121884 0.0086141 -0.016121 0.1175312 -0.0272217 -0.0604003 -0.1101495 -0.0217513 0.0609694 0.0318227 -0.1284723 -0.0179891 -0.0252362 unknown
polarizability: 132.4422168|-0.0218949|104.027553|0.6938516|0.0683272|53.9761727 unknown
InChI: InChI=1S/C8H11NO/c1-6-4-8(10)5-7(2)9(6)3/h4-5H,1-3H3
charge 0 multiplicity 1
21 atoms
O  3.096919 -0.001884 -0.005983
N  -1.085396 0.000994 0.02562
C  -0.375422 1.221114 0.006409
C  -0.377133 -1.220053 0.003079
C  1.007604 1.224749 -0.002942
C  1.005887 -1.225585 -0.006274
C  -2.563254 0.002144 -0.038515
C  1.813058 -0.000987 -0.002395
C  -1.164116 2.514934 0.000764
C  -1.167597 -2.51277 -0.006158
H  1.540044 2.180297 -0.013181
H  1.536993 -2.181843 -0.019154
H  -2.966222 0.888444 0.471485
H  -2.967455 -0.885396 0.46833
H  -2.924643 0.004247 -1.085115
H  -1.735358 2.662226 0.937692
H  -1.878494 2.571652 -0.841653
H  -0.464502 3.35919 -0.09513
H  -1.739163 -2.661823 0.930293
H  -0.469119 -3.357714 -0.104249
H  -1.88193 -2.566239 -0.848827
