program: Gaussian 09
title: 000292265
version: EM64L-G09RevD.01
frameworkgroup: C1[X(C17H16N2)]
method: RPBEPBE
basis: SDD
operation: Freq
keyword: #pfreq=noraman
keyword: PBEPBE/SDD
title: #p freq=noraman PBEPBE/SDD
converged: YES YES NO NO
title: Mulliken charges:
elementType: N N C C C C C C C C C C C C C C C C C H H H H H H H H H H H H H H H H
charge: -0.168311 -0.107617 0.180007 -0.061659 -0.351150 0.314225 -0.277753 0.340613 -0.655291 -0.401183 -0.401299 -0.391802 -0.387002 -0.233263 -0.218212 -0.241719 -0.243476 -0.242919 -0.254999 0.242882 0.217564 0.259296 0.227865 0.219389 0.246898 0.249542 0.262470 0.271736 0.244676 0.229419 0.231384 0.222176 0.222039 0.231419 0.224057
chargesum: 0.00000
title: Mulliken charges with hydrogens summed into heavy atoms:
elementType: N N C C C C C C C C C C C C C C C C C
charge: -0.168311 -0.107617 0.180007 -0.061659 0.109296 0.314225 -0.018458 0.340613 0.038861 -0.151641 -0.138829 -0.120067 -0.142326 -0.003844 0.013172 -0.019544 -0.021437 -0.011500 -0.030942
polarizability: 2.49875412e+02 -5.79321654e+00 2.23424143e+02 1.86192649e+01 6.13972031e-01 1.22028847e+02
1716.lowfreq: -6.9813 -3.0875 -0.0006 -0.0004 -0.0001 8.1474 27.6072 45.8804 47.4496
frequency: 27.5164 45.8456 47.4422 62.8706 68.5743 110.5149 135.3156 141.3792 209.1177 233.7850 259.6845 268.6390 316.5059 365.7867 391.3975 404.8140 407.8345 435.1644 481.0038 509.1352 554.3973 611.9178 615.8121 638.6964 654.6326 685.2160 701.2138 704.6962 713.1684 719.0430 771.1846 776.1749 787.5493 793.5951 854.6345 862.2506 924.2161 928.8158 933.9333 959.0061 980.6707 984.0750 987.1975 988.7940 996.2784 998.7048 1011.5875 1025.1524 1039.4008 1069.8467 1078.1167 1078.6656 1089.5880 1110.1944 1170.4225 1172.8145 1182.2369 1187.8655 1189.7881 1229.7084 1237.8437 1311.0023 1314.8048 1327.9373 1341.1337 1356.8918 1368.2476 1376.7386 1389.4994 1392.9803 1428.7705 1433.1146 1441.4399 1461.9463 1467.6207 1479.6115 1488.9334 1497.5958 1550.3477 1580.2609 1584.2734 1612.8629 1616.5411 2990.9461 3019.8620 3072.6614 3091.3007 3103.6115 3120.2362 3121.6466 3129.4843 3131.2769 3141.2248 3149.2684 3151.3896 3161.0040 3166.0888 3168.2154 3223.7819
redmass: 3.8711 2.7344 4.1112 4.1415 3.9627 4.6138 3.7148 3.9357 1.2955 4.2709 3.1111 3.8430 4.2436 4.0392 3.9329 2.8834 2.8699 4.7053 4.3270 3.4626 3.4211 6.1377 6.3907 5.4793 3.5275 6.1786 1.8407 2.6037 2.9051 3.2661 1.6227 1.7926 1.7541 1.3394 1.2477 1.2417 2.4939 1.5229 2.0106 2.6026 1.3836 1.4436 5.2975 5.1832 1.3304 1.3297 4.5245 2.3712 2.2298 1.9870 1.6455 1.7487 1.9325 2.4046 1.0581 1.0538 2.3286 1.1216 1.1303 1.6977 2.6763 1.4562 1.6687 1.8156 1.6331 2.2440 6.1602 5.9912 1.2229 3.5573 2.5115 2.5264 2.4888 2.2309 1.0626 1.1148 1.1722 2.5577 7.1486 6.0047 6.1822 6.2748 6.1233 1.0354 1.0613 1.1015 1.0992 1.1026 1.0845 1.0860 1.0871 1.0891 1.0924 1.0940 1.0963 1.0946 1.1016 1.0993 1.0980
irintensity: 0.3018 0.0799 0.7429 1.4444 1.0014 0.6222 1.2550 1.5391 0.0870 0.9402 0.9164 0.2534 0.6188 2.0453 1.1132 0.2370 0.1303 0.4242 1.8811 2.5253 10.0638 0.4476 0.0213 5.7226 20.5025 4.4118 46.5499 35.5564 8.9085 14.6851 43.3867 73.8849 11.5703 9.4995 1.1475 0.2929 26.7859 3.8924 3.3915 3.7377 1.1442 0.2908 0.2964 0.5014 0.6719 0.2230 5.5746 10.6328 1.4728 10.2314 6.3190 4.6390 9.9342 3.7980 0.3330 0.0061 15.7512 2.8771 3.9270 2.8896 34.5238 1.2001 6.4194 25.0534 25.2466 3.6505 2.7262 3.1637 15.6552 5.1091 7.2202 12.7487 13.8645 14.2380 6.4663 5.8087 12.7863 51.2504 4.4901 2.1356 0.5589 20.9615 15.9225 22.3299 36.9684 2.0927 41.8356 31.5771 0.9536 4.5294 0.3680 15.3878 17.2686 40.5504 26.9357 18.4207 20.6198 12.8057 2.4981
temp: 298.150 k
press: 1.00000 atm
elementType: 7 7 6 6 6 6 6 6 6 6 6 6 6 6 6 6 6 6 6 1 1 1 1 1 1 1 1 1 1 1 1 1 1 1 1
symmnumber: 1
zpe: 745787.8 jmol-1
zpe.correction: 0.284056 hartree
zpe.thermalcorrener: 0.300189 hartree
zpe.thermalcorrenthalpy: 0.301133 hartree
zpe.thermalcorrgfe: 0.238814 hartree
zpe.sumelectzpe: -765.591980 hartree
zpe.sumelectthermal: -765.575846 hartree
zpe.sumelectthermalent: -765.574902 hartree
zpe.sumelectthermalfe: -765.637221 hartree
dipole: -4.7112 1.0949 0.3007
dipole: 4.8461
quadrupole: -100.7522 -102.5637 -111.2881
quadrupole: 7.6133 5.0933 -0.5379
quadrupole: 4.1158 2.3043 -6.4201 7.6133 5.0933 -0.5379
hfenergy: -765.8760351 hartree
pointgroup: C01 [X(C17H16N2)]
dipole: 1.8080667 -0.5723884 -0.1960052 debye
polarizability: 241.8919867|-2.9430546|222.1449227|-34.7448811|15.4765417|131.2914916 unknown
InChI: InChI=1S/C17H16N2/c1-2-19-13-18-16(14-9-5-3-6-10-14)17(19)15-11-7-4-8-12-15/h3-13H,2H2,1H3
charge 0 multiplicity 1
35 atoms
N  1.566707 1.818666 -0.240001
N  -0.490836 2.631436 0.251906
C  0.708479 0.697655 -0.159531
C  -0.570833 1.225841 0.136664
C  3.039616 1.813261 -0.362247
C  1.20322 -0.689483 -0.317961
C  0.793887 2.944537 0.02655
C  -1.876676 0.550515 0.281352
C  3.74382 1.486316 0.970916
C  1.833321 -1.119141 -1.518951
C  1.056311 -1.624656 0.743779
C  -2.938348 1.248449 0.923275
C  -2.129967 -0.757908 -0.216783
C  2.311226 -2.442013 -1.650693
C  1.527114 -2.948262 0.609029
C  -4.204965 0.649811 1.080851
C  -3.398982 -1.354848 -0.056731
C  2.161731 -3.361403 -0.586616
C  -4.442784 -0.65852 0.596033
H  3.333073 1.082926 -1.134685
H  3.339415 2.813838 -0.722651
H  1.211502 3.94926 0.038524
H  3.462259 2.212047 1.753956
H  4.840323 1.52335 0.8389
H  3.472539 0.47518 1.319538
H  1.914327 -0.424273 -2.363491
H  0.56521 -1.304695 1.669252
H  -2.745857 2.264785 1.280796
H  -1.342871 -1.3057 -0.743598
H  2.787501 -2.757147 -2.585862
H  1.401997 -3.655557 1.436451
H  -5.008592 1.203704 1.579851
H  -3.575265 -2.362504 -0.450745
H  2.528939 -4.38853 -0.689554
H  -5.427141 -1.124642 0.718076
