program: Gaussian 09
title: 000292268
version: EM64L-G09RevD.01
frameworkgroup: C1[X(C15H22O3)]
method: RPBEPBE
basis: SDD
operation: Freq
keyword: #pfreq=noraman
keyword: PBEPBE/SDD
title: #p freq=noraman PBEPBE/SDD
converged: YES YES NO NO
title: Mulliken charges:
elementType: O O O C C C C C C C C C C C C C C C H H H H H H H H H H H H H H H H H H H H H H
charge: -0.293915 -0.259351 -0.436362 0.015692 0.154956 0.494645 -0.442612 -0.427121 -0.457630 0.450963 -0.739144 -0.723194 -0.762282 -0.612675 -0.600308 0.170169 -0.266936 -0.342484 0.214531 0.230855 0.206009 0.207946 0.199721 0.219786 0.238517 0.231341 0.225037 0.220309 0.227565 0.211749 0.231419 0.219383 0.219241 0.273929 0.275305 0.237138 0.214565 0.205197 0.220182 0.347864
chargesum: 0.00000
title: Mulliken charges with hydrogens summed into heavy atoms:
elementType: O O O C C C C C C C C C C C C C C C
charge: -0.293915 -0.259351 -0.088498 0.015692 0.154956 0.494645 0.002775 -0.013166 -0.038124 0.450963 -0.044249 -0.063571 -0.092240 -0.338746 -0.325003 0.170169 0.184767 0.082895
polarizability: 1.96531713e+02 3.72466634e-01 1.93534107e+02 3.73650445e+00 -1.82689538e+00 1.23990923e+02
1716.lowfreq: -14.8445 -0.0004 -0.0003 0.0006 3.1890 16.0229 27.0201 51.2695 57.8597
frequency: 26.4550 51.2108 57.6987 92.3440 117.8428 131.8410 143.0587 155.3043 189.2691 208.9270 227.2514 248.0053 262.2833 270.2961 284.2019 289.5865 307.3235 321.6586 339.0263 349.9680 367.4951 405.1387 413.8592 429.1084 453.8328 484.3436 511.3006 522.6306 588.9966 632.6529 642.5705 667.3401 686.1263 700.4379 753.7652 802.6793 848.7052 853.4511 866.0169 876.1502 880.6397 908.6425 913.1350 933.1316 946.0245 955.4834 964.3095 979.0526 987.4797 1002.0790 1020.4119 1047.7070 1053.1630 1080.4083 1085.0449 1123.2847 1136.2572 1148.1816 1173.0810 1185.5767 1188.0488 1195.0991 1213.3428 1216.2621 1253.6156 1286.5854 1300.7959 1313.3243 1329.2763 1331.6432 1338.2635 1344.5254 1347.0505 1366.9518 1374.5199 1380.8592 1382.3139 1395.5080 1453.1167 1454.1935 1457.5943 1459.5609 1464.3811 1466.7807 1471.3574 1479.1137 1484.2885 1492.6802 1499.2870 1551.0998 1591.2141 1647.1330 2964.5349 2974.9043 2977.0540 2980.1773 2984.7058 2986.3404 2987.2656 3000.0200 3023.7849 3039.7976 3052.5735 3064.1421 3068.6795 3074.5959 3082.3374 3085.3318 3094.1580 3102.3782 3121.8303 3165.0687 3167.3261 3557.4490
redmass: 4.0448 4.3924 5.6507 3.0464 2.7093 3.6334 1.2143 2.2637 4.7866 1.8147 3.0505 3.2657 3.3995 2.3387 2.4362 2.2989 2.7525 1.0698 2.2828 2.3647 2.3440 1.2634 3.0240 3.2439 3.3489 3.1960 2.7504 3.2373 3.7546 3.5150 3.8631 4.3397 2.5933 4.6440 3.3440 2.3822 1.5539 1.6352 2.4964 2.3199 2.3064 1.8842 1.7162 1.5735 2.2572 1.9932 1.8951 2.1962 1.7178 1.6335 1.9297 2.8763 1.6617 1.6566 1.7657 2.9999 2.6817 2.3126 2.3108 1.3976 1.9741 2.1968 1.8216 1.2034 1.6729 1.3542 2.0313 1.6034 1.2398 1.5148 1.7186 1.4996 1.7416 1.8376 1.2188 1.2282 1.2835 1.2020 1.0755 1.0924 1.0843 1.0655 1.0590 1.0683 1.0800 1.0622 1.0623 1.0609 1.0553 9.1677 8.3041 7.5002 1.0597 1.0678 1.0355 1.0564 1.0394 1.0593 1.0654 1.0359 1.0992 1.1002 1.1067 1.0993 1.0998 1.0987 1.1003 1.0966 1.1003 1.0977 1.0970 1.0909 1.0913 1.0657
irintensity: 0.2853 2.7894 2.3141 0.8139 0.4860 1.2367 0.6228 4.9360 6.2826 0.4370 1.2738 4.2912 2.3966 0.4174 1.3458 1.4725 3.2448 0.0770 2.1396 6.8997 1.2988 172.0212 3.5794 8.0865 4.4952 2.0496 5.0135 1.1985 2.5008 22.1014 2.4498 1.1804 6.0215 6.1317 3.1546 0.8963 7.8763 3.1104 34.1883 2.5815 25.2416 1.6549 30.8712 3.9593 2.8081 0.2120 20.8200 47.5844 11.5144 38.3715 25.6898 51.4550 1.3401 0.2856 14.5585 165.4510 1.5493 50.6944 39.3619 15.6530 38.3728 1.5097 1.9343 18.2782 20.2437 1.6071 3.1824 7.3538 35.7507 38.3737 20.0738 10.8481 34.7631 25.3844 4.4452 24.6309 20.5689 20.6724 1.9250 17.1597 8.1025 10.8560 4.2969 11.2192 8.9165 10.1321 23.9548 6.5356 17.4960 135.9423 106.1043 244.0502 31.2178 43.9289 27.5321 28.6166 23.2927 34.3189 21.1725 27.2215 39.0162 50.1244 33.8427 28.2569 4.3430 63.4478 33.8942 26.3696 27.4421 22.3346 28.0737 15.3146 0.4586 4.1184
temp: 298.150 k
press: 1.00000 atm
elementType: 8 8 8 6 6 6 6 6 6 6 6 6 6 6 6 6 6 6 1 1 1 1 1 1 1 1 1 1 1 1 1 1 1 1 1 1 1 1 1 1
symmnumber: 1
zpe: 892339.3 jmol-1
zpe.correction: 0.339874 hartree
zpe.thermalcorrener: 0.358481 hartree
zpe.thermalcorrenthalpy: 0.359426 hartree
zpe.thermalcorrgfe: 0.293954 hartree
zpe.sumelectzpe: -809.035306 hartree
zpe.sumelectthermal: -809.016698 hartree
zpe.sumelectthermalent: -809.015754 hartree
zpe.sumelectthermalfe: -809.081225 hartree
dipole: 0.8269 -4.7075 -1.2610
dipole: 4.9431
quadrupole: -107.1925 -130.3180 -108.1470
quadrupole: -10.9426 8.3758 0.0832
quadrupole: 8.0267 -15.0989 7.0722 -10.9426 8.3758 0.0832
hfenergy: -809.3751798 hartree
pointgroup: C01 [X(C15H22O3)]
dipole: -0.2098833 1.9293162 0.1258692 debye
polarizability: 196.4511011|1.6623687|185.2592239|-4.3290111|22.5409857|132.3464174 unknown
InChI: InChI=1S/C15H22O3/c1-14(2)5-4-6-15(3)12(14)9-11(17)10-13(15)18-8-7-16/h9-10,16H,4-8H2,1-3H3
charge 0 multiplicity 1
40 atoms
O  2.283305 0.258488 -0.366808
O  -0.564175 -3.533418 -1.342071
O  4.846857 0.822735 0.853783
C  -0.073057 0.43318 0.139659
C  -2.734258 0.664317 0.110506
C  -1.461399 -0.18665 -0.138423
C  0.003977 1.879439 -0.466514
C  -2.522209 2.100392 -0.474076
C  -1.19317 2.757278 -0.055386
C  1.061295 -0.415767 -0.4419
C  0.215183 0.482514 1.687087
C  -3.088688 0.751378 1.631469
C  -3.976082 0.057106 -0.599874
C  -1.560397 -1.468409 -0.609629
C  0.921813 -1.694945 -0.910444
C  -0.404828 -2.322074 -0.964786
C  3.510351 -0.450876 -0.800452
C  4.6570 0.529696 -0.568397
H  0.027344 1.796157 -1.571437
H  0.958325 2.341203 -0.158113
H  -3.380094 2.730747 -0.166898
H  -2.551974 2.03445 -1.5813
H  -1.179959 2.946982 1.03537
H  -1.099063 3.74808 -0.54015
H  0.030993 -0.502541 2.149064
H  1.271731 0.75805 1.850048
H  -0.412152 1.228982 2.195632
H  -4.102894 1.178729 1.742877
H  -3.088408 -0.252333 2.09322
H  -2.397678 1.391287 2.203032
H  -3.783367 -0.12834 -1.671661
H  -4.299511 -0.891338 -0.134458
H  -4.820182 0.767092 -0.520923
H  -2.531296 -1.939275 -0.788472
H  1.761998 -2.301449 -1.260465
H  3.637572 -1.362961 -0.186034
H  3.4210 -0.72891 -1.869428
H  4.476724 1.457238 -1.150859
H  5.604825 0.076711 -0.904201
H  3.988049 1.167955 1.209112
