program: Gaussian 09
title: 000292260
version: EM64L-G09RevD.01
frameworkgroup: C1[X(C13H10S3)]
method: RPBEPBE
basis: SDD
operation: Freq
keyword: #pfreq=noraman
keyword: PBEPBE/SDD
title: #p freq=noraman PBEPBE/SDD
converged: YES YES NO NO
title: Mulliken charges:
elementType: S S S C C C C C C C C C C C C C H H H H H H H H H H
charge: 0.372478 0.372367 0.152532 -0.191370 -0.191308 -0.189792 -0.190033 -0.235671 -0.235476 -0.215148 -0.215085 -0.204635 -0.204668 -0.235379 -0.235370 -0.776836 0.261913 0.261873 0.250243 0.250276 0.234252 0.234245 0.232734 0.232740 0.232558 0.232560
chargesum: 0.00000
title: Mulliken charges with hydrogens summed into heavy atoms:
elementType: S S S C C C C C C C C C C C C C
charge: 0.372478 0.372367 0.152532 -0.191370 -0.191308 0.072121 0.071839 0.014572 0.014800 0.019104 0.019160 0.028099 0.028072 -0.002821 -0.002810 -0.776836
polarizability: 2.73204577e+02 3.83431241e-02 1.45287363e+02 7.28139475e-03 -1.85264433e+01 1.46667723e+02
1716.lowfreq: 0.0027 0.0029 0.0031 3.5636 9.5000 11.2189 33.1414 42.5013 56.2085
frequency: 33.1412 42.4553 56.1017 66.4236 71.9247 77.5751 179.9431 203.6602 225.7103 250.8618 282.6558 284.9395 396.6481 399.4994 401.3101 404.0609 441.7901 446.1055 494.6513 502.0024 608.8170 608.8474 669.7549 672.7842 691.9002 692.9344 738.9233 752.9690 782.2142 844.1458 845.9134 921.3917 922.5810 974.4235 975.1717 984.9549 985.6514 996.4337 996.8861 999.5775 1013.3672 1016.1967 1068.8673 1071.1053 1076.5623 1077.4961 1172.6987 1173.0488 1185.8475 1186.4265 1306.9495 1307.2642 1377.0532 1377.1008 1428.3387 1428.4511 1458.3115 1458.8711 1585.9262 1586.0408 1587.6960 1588.0912 3129.9048 3129.9408 3139.7378 3139.8837 3152.1556 3152.2989 3160.9524 3161.0616 3171.1185 3171.1530
redmass: 5.4430 13.2107 3.9306 5.1331 6.8902 5.4457 5.4374 6.5962 7.9088 6.3824 7.1426 9.6254 5.1302 3.7888 4.4469 4.1820 6.3088 20.0867 4.8004 4.3835 6.4659 6.4742 6.7272 6.6802 2.2475 2.2607 1.8682 1.4966 4.4684 1.2491 1.2464 1.3641 1.3815 1.4382 1.4439 5.6290 5.4653 1.4353 1.3229 6.5571 3.6273 3.5531 2.3173 2.3881 1.5978 1.6110 1.0525 1.0530 1.1163 1.1147 1.3011 1.3012 9.7715 9.8608 2.1157 2.1177 2.0549 2.0569 5.9782 5.9896 6.2872 6.3220 1.0850 1.0850 1.0885 1.0885 1.0929 1.0928 1.0967 1.0967 1.1015 1.1014
irintensity: 0.3702 0.3348 0.1012 0.0776 0.2106 0.6317 0.0031 1.9980 1.4617 0.9622 0.2028 0.0242 0.2886 1.6823 2.4528 1.6646 14.1490 3.9521 32.2584 2.7737 0.1471 0.0035 3.7583 8.4331 82.2844 0.0178 23.7761 1.0256 206.3552 1.6461 1.8570 0.0156 8.8661 1.1818 1.3895 24.4041 1.4902 19.4041 0.2377 234.7987 3.8747 5.1623 0.3128 4.2736 10.9259 0.4951 0.0036 0.0013 0.0198 2.7871 0.7448 2.2545 0.7527 0.4181 18.4987 4.8291 12.6029 27.8112 8.9883 3.5080 0.1109 2.6081 0.2993 0.0408 10.1424 2.2808 11.9034 17.7853 21.0367 7.8317 21.6395 8.2332
temp: 298.150 k
press: 1.00000 atm
elementType: 16 16 16 6 6 6 6 6 6 6 6 6 6 6 6 6 1 1 1 1 1 1 1 1 1 1
symmnumber: 1
zpe: 490275.4 jmol-1
zpe.correction: 0.186736 hartree
zpe.thermalcorrener: 0.201641 hartree
zpe.thermalcorrenthalpy: 0.202585 hartree
zpe.thermalcorrgfe: 0.142563 hartree
zpe.sumelectzpe: -1694.429378 hartree
zpe.sumelectthermal: -1694.414473 hartree
zpe.sumelectthermalent: -1694.413528 hartree
zpe.sumelectthermalfe: -1694.473550 hartree
dipole: 5.7306 0.0013 0.0012
dipole: 5.7306
quadrupole: -115.3451 -113.0975 -109.9545
quadrupole: -0.0025 -0.0003 -9.6345
quadrupole: -2.5461 -0.2985 2.8445 -0.0025 -0.0003 -9.6345
hfenergy: -1694.6161136 hartree
pointgroup: C01 [X(C13H10S3)]
dipole: -0.005414 2.2545066 0.0202854 debye
dipolederiv: -0.0754693 0.048294 0.1336973 0.1772244 -0.3839035 -0.2277971 0.366957 -0.3319313 -0.1988106 -0.0746019 -0.0489227 0.1317591 -0.1818911 -0.3949773 0.2249401 0.3616964 0.3303445 -0.1884284 -0.1391017 0.0025266 0.081059 0.0013045 -1.1693892 -0.0089647 0.1427513 -0.0087884 -0.1402184 0.0832389 -0.1108589 0.0753035 -0.242409 0.390233 -0.0018048 0.1316061 -0.0957333 -0.1302147 0.0815689 0.1077193 0.077194 0.2383956 0.3899089 0.0113022 0.135169 0.1052866 -0.1283177 -0.1090751 -0.0015277 -0.001148 0.1603701 -0.1500413 0.0708279 0.0192137 0.0802847 -0.0669985 -0.108187 0.0016827 -0.0006693 -0.1606375 -0.1482791 -0.072246 0.0170028 -0.0813433 -0.0697021 -0.0907772 0.1283406 0.1034744 0.0365013 -0.1943408 -0.0359745 0.0065465 0.0777771 -0.0229338 -0.0898928 -0.1296541 0.1009456 -0.0360382 -0.1943946 0.0335555 0.0062893 -0.0806665 -0.0238367 -0.0280242 0.0054546 0.1409395 -0.0185616 -0.0584439 -0.0271593 0.1414404 0.0351052 0.0377252 -0.0278907 -0.0077376 0.140713 0.016252 -0.0583334 0.0262101 0.1418909 -0.0360972 0.0374056 -0.1084632 0.0298265 0.0504335 0.0398048 0.0896295 0.0937256 0.0530579 0.0399662 -0.0487194 -0.1080903 -0.0316849 0.0503736 -0.0417607 0.091575 -0.0910804 0.0525452 -0.0372933 -0.0510124 -0.0952885 -0.064034 0.0776392 -0.0630517 0.0680345 -0.0515946 0.0643969 -0.0315069 -0.0617343 -0.0958311 0.0618503 0.0784967 0.0611291 0.067224 0.0541756 0.065292 0.0339567 -0.0603108 0.1306554 0.0003872 -0.5227099 0.0044319 1.6415653 0.0088899 -0.9289178 0.007751 0.5057666 0.1439121 -0.0011452 -0.0202322 -0.0347713 -0.0130596 -0.0513086 -0.0268658 -0.0549628 0.0740787 0.143654 0.0023338 -0.0204977 0.0360919 -0.0146839 0.0496592 -0.0265656 0.0532918 0.0759499 0.0508338 -0.0028167 -0.1171601 -0.0059522 0.095583 0.0261057 -0.0973244 0.009259 0.0609851 0.0507107 0.0046309 -0.1169239 0.0074091 0.0962647 -0.0261016 -0.0971698 -0.0091785 0.0604818 0.0322062 0.0258645 -0.1159149 0.0236925 0.0648124 -0.0099184 -0.1457374 0.0121485 0.0051035 0.0322811 -0.0240254 -0.1164599 -0.0213266 0.0645874 0.0103554 -0.1460826 -0.0118542 0.0052042 0.1108848 -0.042441 -0.0575108 0.0031858 -0.0699059 -0.088806 -0.0530595 -0.0693404 0.0649174 0.1106339 0.0443781 -0.0572189 -0.0013135 -0.0724221 0.0861116 -0.0534605 0.0666844 0.0676535 0.0896566 0.0791544 -0.0472119 0.0977177 -0.0689786 0.03912 -0.0646369 0.0496104 0.0987515 0.0904564 -0.0775951 -0.048371 -0.0957972 -0.0682648 -0.0422227 -0.0660351 -0.0527701 0.0972148 unknown
polarizability: 150.519393|-0.4653112|273.192784|17.9710778|1.2067695|141.4474868 unknown
InChI: InChI=1S/C13H10S3/c14-13(15-11-7-3-1-4-8-11)16-12-9-5-2-6-10-12/h1-10H
charge 0 multiplicity 1
26 atoms
S  -0.71719 -2.070485 1.401575
S  0.728532 -2.040908 -1.443721
S  0.012822 -4.633417 -0.044502
C  -1.386465 -0.469475 0.755588
C  1.390079 -0.448365 -0.769408
C  -2.301491 -0.464947 -0.321954
C  2.305649 -0.457961 0.307633
C  -1.063796 0.721559 1.442992
C  1.061015 0.752779 -1.435878
C  -2.880497 0.758033 -0.729029
C  2.878658 0.760683 0.735637
C  -1.664623 1.93651 1.041441
C  1.655956 1.963596 -1.013582
C  -2.566895 1.95831 -0.047081
C  2.558629 1.971045 0.074805
C  0.007631 -2.951934 -0.029373
H  -2.562029 -1.39982 -0.828276
H  2.571242 -1.400162 0.797442
H  -0.3455 0.701957 2.268892
H  0.342441 0.743846 -2.26173
H  -3.588124 0.768685 -1.565372
H  3.586735 0.760386 1.571671
H  -1.418377 2.862157 1.572686
H  1.40484 2.897072 -1.5286
H  -3.028081 2.902027 -0.358757
H  3.015241 2.911526 0.402603
