program: Gaussian 09
title: 000292263
version: EM64L-G09RevD.01
frameworkgroup: C1[X(C16H16N2O)]
method: RPBEPBE
basis: SDD
operation: Freq
keyword: #p
keyword: freq=noraman
keyword: PBEPBE/SDD
title: #p freq=noraman PBEPBE/SDD
converged: YES YES NO NO
title: Mulliken charges:
elementType: O N N C C C C C C C C C C C C C C C C H H H H H H H H H H H H H H H H
charge: -0.270285 -0.290275 -0.394094 -0.352357 -0.239846 0.582515 0.501076 -0.516189 0.136982 -0.447883 -0.396355 -0.421421 -0.406020 -0.222561 -0.249925 -0.222310 -0.227527 -0.238257 -0.240652 0.257382 0.244818 0.275014 0.320871 0.253690 0.250229 0.232823 0.219178 0.234316 0.255893 0.227920 0.226824 0.227333 0.227812 0.230660 0.230622
chargesum: 0.00000
title: Mulliken charges with hydrogens summed into heavy atoms:
elementType: O N N C C C C C C C C C C C C C C C C
charge: -0.270285 -0.015262 -0.073223 -0.094976 0.004972 0.582515 0.501076 -0.012270 0.136982 -0.215061 -0.177177 -0.187105 -0.150128 0.005359 -0.023101 0.005023 0.000285 -0.007596 -0.010030
polarizability: 2.11995185e+02 -1.69187611e+01 1.82125243e+02 1.65661273e+01 1.71827845e+01 1.41771149e+02
1716.lowfreq: -12.1323 -9.4427 -7.1159 -0.0008 -0.0008 -0.0004 21.6289 30.5027 42.5708
frequency: 20.1376 30.4948 42.4654 63.3446 77.0072 94.4211 145.3674 211.3153 222.7676 237.1114 252.2358 307.7750 326.1940 401.4453 403.4235 415.1985 454.8920 482.7955 489.4461 514.0732 557.5011 575.2717 592.3594 615.0346 616.7907 624.1114 697.1629 700.0779 703.8479 711.5738 763.6083 773.5504 821.2878 842.2096 849.3665 857.6999 872.1019 911.9348 921.2693 950.4762 972.1570 976.4240 980.5519 990.4024 990.7522 996.3549 998.7167 1026.3161 1027.8327 1054.2671 1076.8804 1088.1196 1107.6093 1146.7006 1173.0942 1173.2582 1188.0266 1189.8437 1202.0903 1207.5981 1211.3632 1244.9251 1281.3752 1303.6925 1319.4900 1335.5115 1336.5325 1339.7021 1364.1551 1384.4872 1388.1823 1406.2716 1436.8837 1439.2852 1442.1442 1446.9750 1482.2213 1485.4864 1593.0322 1594.2263 1612.5103 1616.3942 1622.3293 2945.7590 2975.6057 2990.6257 3079.3782 3100.1657 3120.6673 3123.0524 3124.1666 3134.1751 3135.9819 3146.6430 3147.3308 3164.3640 3164.4963 3479.9507 3496.6654
redmass: 3.8700 4.1891 4.2924 6.6665 4.0430 5.0710 2.8662 4.5105 4.5358 5.4095 2.9887 5.3811 5.2421 2.8003 2.8244 5.4395 2.9642 3.1396 2.6837 3.0509 3.8979 2.3433 2.7482 5.8988 6.1382 5.9143 3.7483 1.7414 1.6700 1.6343 1.8981 1.9785 4.5444 3.5815 1.2651 1.2627 3.1855 1.5364 1.5096 2.3894 1.6044 2.5912 1.4283 5.9185 6.2440 1.3407 1.3323 2.1885 2.1542 2.5275 1.8078 1.7113 3.0307 5.7273 1.0557 1.0536 1.1113 1.1169 1.6347 2.1125 1.3256 1.7446 1.5176 1.6092 1.4282 1.2910 1.1991 1.3345 2.5317 6.3935 4.9950 1.7627 1.2623 1.6075 1.9838 1.3659 2.2790 2.3629 6.0682 6.0232 6.0738 6.2372 5.8350 1.0827 1.0684 1.0857 1.0936 1.0886 1.0856 1.0876 1.0861 1.0905 1.0913 1.0956 1.0960 1.1014 1.1014 1.0755 1.0758
irintensity: 0.0260 0.1931 0.0910 2.1299 0.2073 0.0338 6.8469 3.2832 1.5052 1.5093 7.6497 2.0276 0.0893 0.2673 0.5086 25.3365 3.0693 11.9455 39.6608 12.3781 8.3557 117.1613 52.8880 1.6018 1.0329 1.0627 29.9954 105.2780 61.8049 26.9880 20.5970 74.9653 1.4398 1.3762 0.2523 1.1154 17.3260 4.7506 0.5760 8.5362 4.6566 15.3074 0.9255 0.2925 0.5702 0.0812 1.1292 9.4985 3.8045 4.7743 11.8746 7.9250 7.8323 30.9238 0.0478 0.1560 0.5138 0.1618 1.0449 6.0905 37.0454 17.5000 36.5579 53.0457 30.4003 14.0400 2.6536 11.1402 75.1767 0.3797 2.6554 15.9352 10.8850 3.5010 14.8039 19.5190 14.1507 9.7988 1.7946 2.5494 10.5652 2.5980 387.6448 25.9134 32.8000 26.0169 10.2223 18.2082 6.6026 0.4682 2.7765 9.6992 10.4176 29.8912 38.7288 18.5141 26.5063 1.9179 15.8130
temp: 298.150 k
press: 1.00000 atm
elementType: 8 7 7 6 6 6 6 6 6 6 6 6 6 6 6 6 6 6 6 1 1 1 1 1 1 1 1 1 1 1 1 1 1 1 1
symmnumber: 1
zpe: 746065.1 jmol-1
zpe.correction: 0.284161 hartree
zpe.thermalcorrener: 0.300127 hartree
zpe.thermalcorrenthalpy: 0.301071 hartree
zpe.thermalcorrgfe: 0.238585 hartree
zpe.sumelectzpe: -802.684893 hartree
zpe.sumelectthermal: -802.668927 hartree
zpe.sumelectthermalent: -802.667983 hartree
zpe.sumelectthermalfe: -802.730469 hartree
dipole: -4.6384 1.3788 -0.8167
dipole: 4.9074
quadrupole: -129.7107 -106.4361 -104.0622
quadrupole: 4.0230 3.9284 6.9227
quadrupole: -16.3077 6.9669 9.3408 4.0230 3.9284 6.9227
hfenergy: -802.9690542 hartree
pointgroup: C01 [X(C16H16N2O1)]
dipole: 1.726473 0.7827819 0.3663623 debye
polarizability: 206.5028602|19.3669008|189.1833753|20.0134107|-11.8307656|140.205341 unknown
InChI: InChI=1S/C16H16N2O/c19-14-11-17-15(12-7-3-1-4-8-12)16(18-14)13-9-5-2-6-10-13/h1-10,15-18H,11H2
charge 0 multiplicity 1
35 atoms
O  -4.266914 -1.837309 0.094081
N  -0.647581 -2.472765 -0.496189
N  -2.400557 -0.543828 0.572001
C  -0.203552 -1.063928 -0.494742
C  -0.951369 -0.22112 0.61338
C  1.308445 -0.96952 -0.328373
C  -0.732307 1.279018 0.437249
C  -2.092798 -2.640252 -0.724335
C  -3.012119 -1.660185 0.025795
C  2.1076 -0.360659 -1.324713
C  1.945777 -1.497316 0.825062
C  0.219999 1.963711 1.231298
C  -1.446287 2.001079 -0.554191
C  3.510914 -0.281684 -1.17978
C  3.348417 -1.426274 0.972278
C  0.459291 3.342586 1.039333
C  -1.209898 3.380114 -0.746302
C  4.136906 -0.816396 -0.030903
C  -0.255393 4.05596 0.049362
H  -0.487458 -0.628576 -1.4737
H  -0.536604 -0.526042 1.598264
H  -0.285846 -3.01056 0.299725
H  -3.032728 0.100587 1.058757
H  -2.404535 -3.663271 -0.45486
H  -2.320063 -2.520666 -1.803428
H  1.627879 0.053632 -2.219358
H  1.352154 -1.970175 1.619182
H  0.780388 1.414451 1.997911
H  -2.197547 1.483732 -1.163123
H  4.113448 0.194093 -1.961467
H  3.825719 -1.843723 1.866031
H  1.19837 3.859277 1.661695
H  -1.770824 3.928238 -1.511722
H  5.225242 -0.759397 0.081903
H  -0.074264 5.126569 -0.097324
