program: Gaussian 09
title: 000292253
version: EM64L-G09RevD.01
frameworkgroup: C1[X(C11H17NO)]
method: RPBEPBE
basis: SDD
operation: Freq
keyword: #p
keyword: freq=noraman
keyword: PBEPBE/SDD
title: #p freq=noraman PBEPBE/SDD
converged: YES YES NO NO
title: Mulliken charges:
elementType: O N C C C C C C C C C C C H H H H H H H H H H H H H H H H H
charge: -0.287714 -0.585206 0.333836 0.231690 -0.405016 -0.526361 -0.469187 -0.056895 0.412543 -0.757087 -0.790916 -0.823043 -0.379524 0.250688 0.230408 0.238366 0.223568 0.226947 0.243254 0.207327 0.211286 0.218875 0.214559 0.234031 0.222995 0.206477 0.236550 0.250922 0.309147 0.377478
chargesum: 0.00000
title: Mulliken charges with hydrogens summed into heavy atoms:
elementType: O N C C C C C C C C C C C
charge: -0.287714 0.101418 0.333836 0.231690 -0.154327 -0.057588 -0.018671 -0.056895 0.412543 -0.095220 -0.123451 -0.157020 -0.128602
polarizability: 1.55509900e+02 5.67919780e+00 1.20191419e+02 -4.15052220e+00 -4.96376150e-01 1.01551116e+02
1716.lowfreq: -22.0175 -15.5037 -11.2317 -0.0002 0.0002 0.0003 87.7455 118.1742 138.2731
frequency: 87.6999 118.0678 138.2563 142.6627 175.4689 198.6063 206.7041 237.4766 258.8372 279.8593 294.3969 307.1757 350.5292 377.3686 402.0564 448.9059 483.1053 496.9320 528.4839 556.3191 603.0445 614.6402 703.6381 723.3447 768.8760 808.6792 837.1786 855.4873 882.1086 898.0382 936.1623 939.3642 942.1094 957.4040 978.8525 1002.2263 1011.1058 1072.4762 1102.8262 1112.2962 1136.2454 1151.0263 1164.7442 1183.4988 1200.5656 1221.8996 1224.8746 1239.0966 1275.2311 1284.5086 1297.4241 1317.8832 1379.4290 1383.6081 1386.1178 1398.4630 1457.8292 1458.6201 1466.9954 1471.1817 1476.8440 1481.9260 1490.9857 1494.4569 1527.2032 1609.2800 1673.4877 2973.1407 2976.5494 2979.7350 2999.2760 3012.5144 3050.2121 3054.1588 3055.2375 3061.1200 3071.5917 3074.2534 3077.2240 3082.5083 3089.4076 3116.6889 3347.6723 3654.2117
redmass: 3.8236 1.2666 1.1522 2.2053 2.7761 2.5000 1.1268 2.5045 3.1814 2.8255 3.1252 1.7813 2.9121 2.7340 2.7965 2.0881 3.3653 1.9767 3.5963 3.7386 3.1796 4.3081 3.7654 2.2301 1.8371 2.2428 1.3580 2.6649 2.9108 2.1985 1.7225 1.4005 1.3666 2.0642 2.0149 1.7538 1.5608 1.3209 1.7129 1.8445 2.0026 2.1275 1.8287 1.6741 1.9387 1.7617 2.4780 1.6810 2.5698 1.5263 2.3643 2.3743 1.2379 2.0445 1.2533 1.2440 1.0565 1.0600 1.0510 1.0627 1.0556 1.0730 1.0918 1.0659 3.0216 1.6950 4.5210 1.0369 1.0369 1.0363 1.0595 1.0631 1.0895 1.1006 1.1017 1.0976 1.0994 1.0982 1.1033 1.0987 1.0967 1.0932 1.0596 1.0916
irintensity: 6.0802 0.8917 0.0260 1.7122 2.4572 0.3642 0.1876 1.9551 3.7678 7.2797 6.4166 10.8315 3.7481 1.1741 23.1603 58.0317 11.8216 57.9813 4.3904 6.9460 0.3388 1.7280 4.8922 4.4055 33.6883 50.6487 5.7985 0.1598 2.6998 10.7856 3.1718 34.3510 6.0456 35.6480 4.1277 0.6275 24.3942 27.2699 25.6500 2.5589 1.7901 8.1442 25.9010 1.8415 13.7280 22.4797 2.6359 1.3326 21.0807 20.4569 43.3445 1.3998 24.0934 11.9845 22.1750 33.2550 8.2301 8.7727 3.2812 3.6343 10.4960 2.5592 10.9664 8.5770 211.4529 20.5567 425.2405 22.4309 31.5646 50.9373 31.3764 59.9528 29.4276 2.1836 0.6534 70.6006 23.2460 8.5375 49.7968 65.3475 30.0342 19.0428 40.2695 79.9671
temp: 298.150 k
press: 1.00000 atm
elementType: 8 7 6 6 6 6 6 6 6 6 6 6 6 1 1 1 1 1 1 1 1 1 1 1 1 1 1 1 1 1
symmnumber: 1
zpe: 678089.4 jmol-1
zpe.correction: 0.258271 hartree
zpe.thermalcorrener: 0.271552 hartree
zpe.thermalcorrenthalpy: 0.272497 hartree
zpe.thermalcorrgfe: 0.220383 hartree
zpe.sumelectzpe: -558.341318 hartree
zpe.sumelectthermal: -558.328037 hartree
zpe.sumelectthermalent: -558.327092 hartree
zpe.sumelectthermalfe: -558.379206 hartree
dipole: -0.9286 -3.0862 0.0869
dipole: 3.2240
quadrupole: -65.2325 -82.5409 -80.5225
quadrupole: 6.4959 -1.5270 -0.4039
quadrupole: 10.8661 -6.4423 -4.4239 6.4959 -1.5270 -0.4039
hfenergy: -558.5995891 hartree
pointgroup: C01 [X(C11H17N1O1)]
dipole: 0.4066245 -1.1995662 0.0677157 debye
polarizability: 156.0376738|-4.6803744|119.7803595|-2.3296567|-1.1606027|101.4344023 unknown
InChI: InChI=1S/C11H17NO/c1-10(2)8-4-5-11(10,3)9(13)7(8)6-12/h6,8H,4-5,12H2,1-3H3
charge 0 multiplicity 1
30 atoms
O  1.408709 1.887258 -0.095278
N  3.465685 0.001035 -0.173382
C  -1.191695 -0.554316 -0.638032
C  -0.864547 0.791525 0.143717
C  -0.134309 -1.398636 0.184361
C  -1.058616 0.33499 1.646552
C  -0.607356 -1.168895 1.663363
C  0.674547 0.837748 -0.013201
C  1.1226 -0.553321 0.006101
C  -0.878241 -0.481233 -2.151102
C  -2.651052 -1.036475 -0.477933
C  -1.593823 2.073786 -0.241678
C  2.453021 -0.923165 -0.056753
H  -0.042391 -2.458144 -0.108885
H  -2.11949 0.450408 1.934917
H  -0.463189 0.96474 2.33085
H  0.213167 -1.354643 2.377092
H  -1.442272 -1.842343 1.928756
H  0.153474 -0.146822 -2.354416
H  -1.009869 -1.475105 -2.619734
H  -1.569482 0.218136 -2.657614
H  -3.338723 -0.36721 -1.027931
H  -2.76638 -2.050803 -0.905757
H  -2.991667 -1.074855 0.569796
H  -1.466224 2.304169 -1.314975
H  -2.675844 2.00161 -0.0253
H  -1.183641 2.931616 0.32121
H  2.755295 -1.977565 -0.021633
H  4.440871 -0.275972 -0.238581
H  3.184343 0.993982 -0.195429
