program: Gaussian 09
title: 000292272
version: EM64L-G09RevD.01
frameworkgroup: C1[X(C11H13Cl3N4O)]
method: RPBEPBE
basis: SDD
operation: Freq
keyword: #p
keyword: freq=noraman
keyword: PBEPBE/SDD
title: #p freq=noraman PBEPBE/SDD
converged: YES YES NO NO
title: Mulliken charges:
elementType: Cl Cl Cl O N N N N C C C C C C C C C C C H H H H H H H H H H H H H
charge: -0.055196 -0.048160 -0.048480 -0.254786 -0.084995 0.005379 -0.164238 -0.592467 -0.321831 -0.315258 -0.554885 -0.583914 0.055387 0.234271 -0.341575 -0.325082 -0.202799 -0.116974 0.128268 0.226001 0.286551 0.225083 0.276313 0.282194 0.264014 0.259241 0.306199 0.252377 0.286272 0.260162 0.326059 0.336870
chargesum: 0.00000
title: Mulliken charges with hydrogens summed into heavy atoms:
elementType: Cl Cl Cl O N N N N C C C C C C C C C C C
charge: -0.055196 -0.048160 -0.048480 -0.254786 -0.084995 0.005379 -0.164238 0.070462 0.190721 0.186137 -0.008677 -0.018474 0.055387 0.234271 -0.089198 -0.038810 0.057363 -0.116974 0.128268
polarizability: 3.03394910e+02 4.94831118e+00 1.85284790e+02 -4.39717172e+00 -1.09351720e+01 1.12396815e+02
1716.lowfreq: -5.9308 -1.7843 -0.0011 0.0008 0.0020 6.7001 16.5554 27.7980 32.5694
frequency: 16.4650 27.7912 32.5433 39.4966 51.6527 55.1637 81.6957 93.8999 119.6655 127.3913 138.7171 162.5564 192.9139 227.4369 246.1045 258.6408 283.2669 300.9510 335.6178 374.4615 383.3660 395.2526 413.0966 449.2564 480.9435 519.3177 535.6391 552.4894 580.0767 583.5528 600.5678 614.6821 661.9281 683.6206 705.6210 752.5727 758.1422 766.1662 821.2927 833.2068 889.9259 898.4382 908.7580 947.4412 960.7555 1005.8714 1026.7786 1043.6437 1059.4844 1076.6812 1091.5466 1109.6701 1125.1810 1140.5610 1195.1929 1210.8664 1252.7504 1253.6979 1266.4313 1274.0897 1311.1033 1321.8380 1337.6409 1348.8885 1363.3444 1372.9863 1383.4836 1396.9310 1438.6840 1446.8214 1451.7164 1454.2655 1458.1276 1552.9566 1587.7493 1597.0800 1629.7873 2948.0241 3027.6996 3058.8272 3066.9412 3088.2390 3095.0563 3138.6779 3154.8434 3159.2349 3169.0174 3179.4862 3514.9758 3668.1754
redmass: 8.9892 14.1585 12.8024 10.7636 6.6700 8.0284 2.6579 4.5029 4.5855 5.9693 5.1169 7.1818 5.5668 5.1583 5.6956 2.9084 4.7325 6.2224 6.4910 3.3124 4.3228 3.8971 5.8985 4.8879 2.2010 1.7091 2.8000 2.3608 2.3172 2.9009 5.1686 4.5100 5.3149 6.0966 4.9116 2.5748 2.2481 2.3804 3.9174 1.4695 2.1019 1.4718 4.2919 1.8635 1.3496 1.6807 2.3389 4.6292 1.9154 2.1435 3.5642 1.7072 1.3857 1.4491 2.6443 1.4305 1.3629 1.2735 1.5627 1.4993 1.4726 3.5273 2.2156 1.2902 4.1843 1.6206 3.1104 4.3717 1.1089 1.1343 1.2425 1.9588 1.1133 7.6292 2.2579 5.1674 2.1734 1.0692 1.0587 1.0587 1.0575 1.0914 1.1039 1.1096 1.0887 1.1111 1.0927 1.0971 1.0452 1.1039
irintensity: 2.8251 1.0587 2.6632 0.1004 6.1890 1.5697 4.2995 2.8308 5.5759 0.1363 1.3446 2.5181 5.7562 4.6133 7.1658 5.6072 3.9226 6.3459 1.4287 3.1942 3.0416 3.0129 2.0525 8.0108 0.5404 31.7597 73.9018 105.3344 125.7178 56.3808 7.9909 8.7777 13.4186 77.8557 21.1915 22.0307 4.7372 11.0011 24.0963 49.3331 12.7130 13.7036 30.8091 11.0798 1.4149 41.6166 31.5327 4.2375 2.9985 7.9709 27.5022 181.5274 14.0246 2.6179 0.4109 28.6745 2.1814 7.9919 8.0718 1.3626 28.8730 89.9225 100.9964 24.6831 24.7783 96.3989 105.4914 154.6194 39.6087 16.9019 36.4235 14.9573 31.4193 16.6723 78.1428 24.8493 231.9259 50.9961 22.2355 27.5283 16.0660 0.7558 5.1257 10.7233 3.2017 5.7642 0.5005 4.4979 36.7545 23.0852
temp: 298.150 k
press: 1.00000 atm
elementType: 17 17 17 8 7 7 7 7 6 6 6 6 6 6 6 6 6 6 6 1 1 1 1 1 1 1 1 1 1 1 1 1
symmnumber: 1
zpe: 614387.6 jmol-1
zpe.correction: 0.234008 hartree
zpe.thermalcorrener: 0.253993 hartree
zpe.thermalcorrenthalpy: 0.254937 hartree
zpe.thermalcorrgfe: 0.181144 hartree
zpe.sumelectzpe: -2099.927474 hartree
zpe.sumelectthermal: -2099.907489 hartree
zpe.sumelectthermalent: -2099.906545 hartree
zpe.sumelectthermalfe: -2099.980338 hartree
dipole: -5.4072 0.7353 -0.2242
dipole: 5.4615
quadrupole: -133.0525 -142.8193 -131.3707
quadrupole: 15.6508 -14.2590 5.3544
quadrupole: 2.6950 -7.0718 4.3768 15.6508 -14.2590 5.3544
hfenergy: -2100.161482 hartree
pointgroup: C01 [X(C11H13Cl3N4O1)]
dipole: -2.1012675 0.2595267 0.3665579 debye
polarizability: 302.3219774|-16.2239149|112.1073614|1.7798319|-1.0471998|186.6471755 unknown
InChI: InChI=1S/C11H13Cl3N4O/c12-3-5-18(6-4-13)17-16-10-2-1-8(14)7-9(10)11(15)19/h1-2,7H,3-6,15H2
charge 0 multiplicity 1
32 atoms
Cl -3.086308 1.783253 -2.752112
Cl -3.900985 0.270564 3.60833
Cl 5.74374 -0.592892 0.330009
O  1.267309 -0.667899 -3.066959
N  -2.320716 -0.1330 -0.205399
N  -0.970271 -0.290442 -0.351718
N  -0.265921 0.123654 0.677852
N  0.517981 1.396354 -2.308479
C  -3.115273 -0.670998 -1.316996
C  -2.93072 0.472435 0.997542
C  -4.040889 0.338963 -2.00364
C  -3.023638 -0.544958 2.1479
C  1.14749 0.012651 0.478419
C  1.82477 -0.01028 -0.783671
C  1.906604 -0.088081 1.675622
C  3.224399 -0.218515 -0.811714
C  3.302076 -0.264554 1.645804
C  3.940401 -0.343508 0.391537
C  1.155699 0.181895 -2.134453
H  -3.759996 -1.506005 -0.964252
H  -2.391367 -1.085818 -2.037029
H  -3.934204 0.848384 0.737078
H  -2.302795 1.322757 1.315623
H  -4.565829 -0.140345 -2.843644
H  -4.769778 0.801674 -1.321431
H  -3.629723 -1.42678 1.892145
H  -2.028441 -0.834593 2.510149
H  1.37144 -0.047574 2.62949
H  3.73546 -0.274395 -1.777148
H  3.877476 -0.349533 2.571573
H  0.419138 2.06315 -1.544622
H  -0.019031 1.547138 -3.162706
