program: Gaussian 09
title: 000292273
version: EM64L-G09RevD.01
frameworkgroup: C1[X(C15H14ClNOS)]
method: RPBEPBE
basis: SDD
operation: Freq
keyword: #p
keyword: freq=noraman
keyword: PBEPBE/SDD
title: #p freq=noraman PBEPBE/SDD
converged: YES YES NO NO
title: Mulliken charges:
elementType: Cl S O N C C C C C C C C C C C C C C C H H H H H H H H H H H H H H
charge: -0.066583 0.211520 -0.283276 -0.504166 0.553600 -0.349644 0.586349 -0.355075 0.397881 0.023502 -0.423253 -0.380487 -0.400704 -0.389470 -0.261199 -0.691324 -0.692126 -0.060464 -0.263906 0.299927 0.196851 0.256394 0.227610 0.254035 0.253240 0.246281 0.213476 0.248045 0.228695 0.204841 0.235462 0.225304 0.258664
chargesum: 0.00000
title: Mulliken charges with hydrogens summed into heavy atoms:
elementType: Cl S O N C C C C C C C C C C C C C C C
charge: -0.066583 0.211520 -0.283276 -0.204239 0.553600 -0.349644 0.586349 -0.355075 0.397881 0.220354 -0.166859 -0.152877 -0.146669 -0.136230 -0.014918 -0.001108 -0.026519 -0.060464 -0.005242
polarizability: 3.62975083e+02 -8.99413672e+00 1.93366442e+02 9.60336864e+00 4.33447567e+00 9.85238945e+01
1716.lowfreq: -7.5634 -2.2010 -0.0020 -0.0018 -0.0016 2.4303 19.5074 43.8846 70.6517
frequency: 19.3081 43.8700 70.6483 80.0959 92.0307 121.3356 151.3695 180.0229 187.2655 212.4633 216.4850 248.2330 261.2596 285.7041 318.4126 334.7325 346.4372 377.8523 410.6966 418.1250 429.6293 438.1261 460.7672 475.5608 521.4375 528.9833 568.0949 578.1759 580.9375 647.7611 667.6099 697.7810 701.2867 714.4652 775.3856 793.3060 806.7133 827.3937 842.9645 845.7072 873.8937 905.3493 926.1609 926.5464 929.2742 934.8166 941.4162 1029.1646 1045.0686 1081.8946 1106.3240 1128.3266 1139.4557 1149.9129 1182.4617 1205.1437 1235.9559 1243.0556 1277.1786 1292.9780 1320.0671 1334.1040 1344.4520 1376.9518 1380.7828 1396.6781 1397.5420 1410.0265 1455.0710 1467.7245 1468.9111 1472.4508 1488.0685 1491.7415 1493.7105 1576.9988 1584.3082 1597.9581 1626.9329 2970.7035 2988.7183 2994.2110 3084.6345 3093.2170 3095.9426 3103.0881 3122.9345 3146.7075 3149.6626 3161.7332 3173.2199 3185.2520 3555.5532
redmass: 7.0662 4.0781 3.7167 4.1729 4.9572 5.3676 7.0839 1.0497 5.6392 5.1080 1.4710 2.5742 4.2857 6.4453 5.0377 3.9993 5.7523 6.0333 4.7154 3.7202 3.5242 3.1451 3.8856 3.6795 5.6793 1.5151 4.2418 4.1006 4.5979 5.7006 6.3910 5.5789 3.9006 3.9294 4.3010 1.3357 1.4856 3.9944 1.6283 1.5204 3.5982 5.5835 1.2835 1.3442 1.3646 3.6521 1.3425 4.1547 3.9420 1.9639 1.7583 1.4429 1.2522 2.1076 1.9469 2.8341 1.6065 2.0492 1.4789 2.4674 1.2950 2.5143 1.3841 5.4104 1.2660 1.5628 2.6787 4.9380 1.0500 1.0615 1.0585 3.3567 1.2459 2.2022 2.1010 5.7146 5.2434 5.8836 7.6268 1.0845 1.0357 1.0359 1.0992 1.1002 1.0997 1.1004 1.0897 1.0900 1.0921 1.0908 1.0947 1.0956 1.0761
irintensity: 0.3249 1.2195 0.0148 0.2034 1.7429 1.0306 0.8384 0.1977 0.7342 0.2746 0.2164 0.4921 1.4239 3.0146 0.7275 1.3860 3.6735 5.0354 3.4053 1.4503 0.7577 1.8612 24.4533 2.0796 22.6073 45.8135 16.7972 11.9908 8.2964 4.6519 4.8050 6.1291 0.9822 1.0177 15.8391 35.0944 51.2972 1.6924 59.0182 21.2404 63.2508 70.7291 2.4204 0.3031 0.5072 105.2106 5.4213 30.4221 12.4086 46.4564 104.3781 23.5747 11.8765 11.7481 16.0374 361.4286 2.0786 4.5745 10.4603 7.5023 23.9916 27.4081 6.7586 46.7196 29.0128 30.6468 15.2989 0.9707 5.6223 15.4468 12.4778 474.6041 102.4303 291.8481 39.1305 97.6917 4.5593 62.2803 50.5204 28.6686 14.8277 29.2112 15.1449 32.8111 35.8789 34.9273 15.6094 4.7213 1.7603 6.5018 5.8746 1.0883 20.9441
temp: 298.150 k
press: 1.00000 atm
elementType: 17 16 8 7 6 6 6 6 6 6 6 6 6 6 6 6 6 6 6 1 1 1 1 1 1 1 1 1 1 1 1 1 1
symmnumber: 1
zpe: 659996.9 jmol-1
zpe.correction: 0.251380 hartree
zpe.thermalcorrener: 0.269090 hartree
zpe.thermalcorrenthalpy: 0.270034 hartree
zpe.thermalcorrgfe: 0.204862 hartree
zpe.sumelectzpe: -1566.738204 hartree
zpe.sumelectthermal: -1566.720494 hartree
zpe.sumelectthermalent: -1566.719550 hartree
zpe.sumelectthermalfe: -1566.784722 hartree
dipole: -2.9089 0.0845 0.3414
dipole: 2.9301
quadrupole: -126.4624 -110.9927 -132.2653
quadrupole: 6.8354 -2.2046 -1.2415
quadrupole: -3.2222 12.2474 -9.0252 6.8354 -2.2046 -1.2415
hfenergy: -1566.9895837 hartree
pointgroup: C01 [X(C15H14Cl1N1O1S1)]
dipole: 1.1525184 0.0033941 0.0242313 debye
polarizability: 359.1201867|-12.4353308|186.6055917|-32.5192077|-23.5326799|109.139641 unknown
InChI: InChI=1S/C15H14ClNOS/c1-9(2)18-11-4-5-12-15(8-11)19-14-6-3-10(16)7-13(14)17-12/h3-9,17H,1-2H3
charge 0 multiplicity 1
33 atoms
Cl -6.284567 -0.339782 1.195635
S  -0.574753 1.349845 -1.294986
O  4.23343 -0.616578 -0.2648
N  -1.371612 -1.458897 -0.178096
C  0.024326 -1.204104 -0.218333
C  0.543582 0.045092 -0.634725
C  -2.372968 -0.478505 -0.066278
C  -2.1382 0.872173 -0.452822
C  2.834929 -0.727761 -0.256848
C  4.865534 0.691195 -0.602321
C  1.930708 0.298214 -0.635428
C  0.941094 -2.21234 0.17716
C  2.328562 -1.988221 0.143773
C  -3.648969 -0.830747 0.450112
C  -3.145364 1.842612 -0.295435
C  4.766452 1.656682 0.592466
C  6.311075 0.34404 -0.971595
C  -4.647544 0.152573 0.554082
C  -4.425424 1.494837 0.200826
H  -1.643937 -2.414209 0.05587
H  4.347689 1.111969 -1.489641
H  2.285282 1.284868 -0.945857
H  0.5598 -3.184503 0.513023
H  3.035171 -2.771227 0.432404
H  -3.850846 -1.859563 0.76561
H  -2.944714 2.880505 -0.581115
H  5.225862 2.628826 0.335648
H  3.719833 1.838949 0.890739
H  5.303908 1.236134 1.460639
H  6.864043 1.258176 -1.253329
H  6.337527 -0.361048 -1.819546
H  6.822278 -0.125582 -0.113008
H  -5.21379 2.244277 0.301076
