program: Gaussian 09
title: 000292269
version: EM64L-G09RevD.01
frameworkgroup: C1[X(C12H17N5O3S)]
method: RPBEPBE
basis: SDD
operation: Freq
keyword: #p
keyword: freq=noraman
keyword: PBEPBE/SDD
title: #p freq=noraman PBEPBE/SDD
converged: YES YES NO NO
title: Mulliken charges:
elementType: S O O O N N N N N C C C C C C C C C C C C H H H H H H H H H H H H H H H H H
charge: 0.272936 -0.304028 -0.235340 -0.431230 -0.263310 -0.191768 -0.044329 0.014669 0.002023 -0.031705 -0.109704 -0.412768 -0.395926 -0.020551 -0.673286 0.148352 -0.233970 0.130358 -0.355037 -0.388330 -0.824221 0.230244 0.238345 0.241679 0.238497 0.263057 0.199414 0.239712 0.308116 0.244506 0.221077 0.241265 0.358679 0.272571 0.245427 0.241453 0.281894 0.281232
chargesum: 0.00000
title: Mulliken charges with hydrogens summed into heavy atoms:
elementType: S O O O N N N N N C C C C C C C C C C C C
charge: 0.272936 -0.304028 -0.235340 -0.072551 0.044806 -0.191768 -0.044329 0.014669 0.002023 0.198539 0.128641 0.067409 0.066544 0.219160 0.033561 0.148352 0.038601 0.130358 -0.355037 -0.142903 -0.019643
polarizability: 2.86577759e+02 1.68237935e+00 1.76683582e+02 1.51597311e+01 1.11582492e+01 1.27885776e+02
1716.lowfreq: -12.3918 -4.6619 -2.7164 -0.0012 -0.0009 0.0000 11.8520 16.3276 24.7275
frequency: 11.3110 15.2544 24.4512 65.0253 75.3658 82.9467 103.7500 122.6853 126.1765 147.1433 155.0399 170.5920 190.1492 216.0933 236.8770 251.7561 261.3176 292.2650 314.8395 332.0849 382.1068 401.0525 410.1752 419.7892 457.2669 473.7090 536.2403 552.8708 561.5037 572.3184 608.1757 627.7648 634.7202 651.9440 661.1257 672.2273 727.2389 748.3603 779.4495 790.8188 804.6064 821.2702 826.0153 836.5207 868.6132 895.3013 921.0358 925.8589 931.3202 978.6656 990.3917 997.8194 1033.1282 1061.3187 1064.9803 1074.9816 1103.0627 1105.9656 1117.0536 1134.9630 1152.9558 1176.5164 1195.3808 1203.0738 1224.1271 1234.3136 1274.2239 1282.3417 1289.1648 1298.3394 1304.3951 1323.9627 1332.1943 1333.5553 1344.5488 1354.7589 1366.5835 1367.2343 1378.9409 1384.6083 1393.3018 1422.6127 1433.8526 1448.4444 1448.4675 1465.3078 1471.6895 1473.3659 1476.9322 1518.7633 1549.4348 2967.7995 2983.8041 2991.3317 3005.5183 3026.1464 3051.1743 3061.8692 3081.9012 3105.3693 3106.6487 3110.9929 3151.1184 3158.1417 3167.6466 3223.7150 3459.0867 3527.2198
redmass: 4.9950 5.6107 6.2827 4.0771 4.2624 3.4754 1.3020 3.7718 4.1042 3.5298 2.1521 1.5447 5.6690 3.6968 4.9993 4.0478 4.6506 4.0303 5.0710 2.8167 3.6030 9.6745 2.2903 1.3841 4.9364 3.8802 4.3732 5.0373 4.4022 6.8790 2.3615 5.4827 4.2095 4.8860 4.9475 6.0128 4.0960 3.4496 3.8194 3.9676 4.8673 2.5067 2.2573 3.9269 4.2395 7.2855 1.4382 1.9547 2.9376 1.1801 1.3237 2.2176 2.7573 1.8764 1.9336 3.9674 4.9427 2.5421 3.6175 2.5942 2.9534 5.2425 1.2068 1.8837 1.3474 1.3218 3.2362 1.6396 7.8791 1.4902 4.0905 1.2576 1.2123 1.2595 1.1381 1.2751 1.3813 3.0351 1.6028 1.2396 1.5754 2.3993 1.0523 1.0630 1.0730 1.0533 1.7191 1.0792 1.1479 6.8638 6.3161 1.0660 1.0694 1.0760 1.0385 1.0282 1.0873 1.0967 1.0911 1.0998 1.0974 1.0985 1.1042 1.1055 1.0920 1.0987 1.0756 1.0650
irintensity: 0.5219 0.9459 0.5057 2.4403 2.9840 2.8414 1.5224 0.8629 4.0085 2.0144 3.7658 0.9449 0.5430 6.4604 0.7269 2.8230 1.0212 4.7744 4.0440 13.8691 23.5177 6.4717 1.8702 102.0704 28.2943 12.0767 2.1277 18.5275 26.3861 5.7649 28.9084 2.7092 21.7691 7.4312 8.3112 8.2454 6.4479 24.2333 68.5116 9.0426 22.5064 18.1826 2.9719 18.4416 96.2634 100.6699 10.5532 9.2585 7.9457 6.9537 3.0458 12.4103 64.5119 79.7915 67.6238 100.2414 3.5428 64.2315 56.6323 12.1368 14.3777 70.1974 38.5384 11.9551 6.9354 22.4346 5.2777 0.6070 94.4698 23.2198 57.5595 2.7785 9.4258 6.7914 1.8747 11.2135 25.7851 7.3550 1.7213 40.8082 35.7831 2.3506 14.0445 33.3281 0.4503 16.9507 45.1175 8.7016 40.6404 180.6616 68.3203 16.6778 19.0949 43.2091 19.8695 24.3806 15.3257 25.3147 4.5081 21.1390 21.7485 33.2685 8.3976 10.0407 15.9031 0.0538 31.8417 11.5297
temp: 298.150 k
press: 1.00000 atm
elementType: 16 8 8 8 7 7 7 7 7 6 6 6 6 6 6 6 6 6 6 6 6 1 1 1 1 1 1 1 1 1 1 1 1 1 1 1 1 1
symmnumber: 1
zpe: 774341.1 jmol-1
zpe.correction: 0.294931 hartree
zpe.thermalcorrener: 0.315467 hartree
zpe.thermalcorrenthalpy: 0.316411 hartree
zpe.thermalcorrgfe: 0.242421 hartree
zpe.sumelectzpe: -1363.309406 hartree
zpe.sumelectthermal: -1363.288870 hartree
zpe.sumelectthermalent: -1363.287926 hartree
zpe.sumelectthermalfe: -1363.361917 hartree
dipole: -4.0056 2.2358 -1.0360
dipole: 4.7028
quadrupole: -120.5212 -133.7416 -130.8867
quadrupole: -1.3095 9.2333 5.2091
quadrupole: 7.8620 -5.3585 -2.5035 -1.3095 9.2333 5.2091
hfenergy: -1363.6043372 hartree
pointgroup: C01 [X(C12H17N5O3S1)]
dipole: 1.6134351 0.0633869 0.9034155 debye
polarizability: 287.0516177|-11.7945108|147.3810083|0.0193862|26.9771596|156.7144903 unknown
InChI: InChI=1S/C12H17N5O3S/c1-7-19-4-8(18)9(20-7)3-16-17-6-15-10-11(17)13-5-14-12(10)21-2/h5-9,16,18H,3-4H2,1-2H3
charge 0 multiplicity 1
38 atoms
S  -5.743758 -0.573552 -0.669035
O  3.320872 -1.040891 -0.352447
O  5.596735 -0.255789 -0.577862
O  3.672164 1.246459 -2.236621
N  0.631829 -0.707153 0.13338
N  -0.723666 -0.830448 -0.235886
N  -2.612356 -1.478527 -1.375489
N  -1.775992 0.626318 1.491494
N  -4.217857 0.712192 1.238226
C  2.81477 0.338074 -0.078853
C  3.743545 1.361614 -0.77739
C  1.378159 0.349803 -0.59847
C  5.191505 1.14116 -0.289818
C  4.720772 -1.243277 0.066399
C  4.888584 -1.302741 1.591507
C  -1.796122 -0.206942 0.416368
C  -1.273778 -1.562584 -1.308396
C  -2.958223 -0.624273 -0.310501
C  -4.200045 -0.119485 0.158533
C  -3.027684 1.040225 1.839842
C  -6.971567 0.379106 0.393398
H  2.806011 0.519185 1.015744
H  3.410614 2.39074 -0.553252
H  1.382158 0.208991 -1.699695
H  0.917071 1.327248 -0.371349
H  5.89306 1.760956 -0.868182
H  5.294795 1.372099 0.789749
H  5.004797 -2.199148 -0.400699
H  1.112092 -1.616726 0.103368
H  5.945778 -1.508387 1.831387
H  4.593121 -0.36973 2.09964
H  4.269599 -2.121866 1.995666
H  4.084153 0.374679 -2.477499
H  -0.645782 -2.143887 -1.981901
H  -3.096846 1.713226 2.699339
H  -7.95821 0.171155 -0.048893
H  -6.738993 1.452043 0.3579
H  -6.919505 0.023035 1.431298
