program: Gaussian 09
title: 000292258
version: EM64L-G09RevD.01
frameworkgroup: C1[X(C16H16N2O)]
method: RPBEPBE
basis: SDD
operation: Freq
keyword: #p
keyword: freq=noraman
keyword: PBEPBE/SDD
title: #p freq=noraman PBEPBE/SDD
converged: YES YES NO NO
title: Mulliken charges:
elementType: O N N C C C C C C C C C C C C C C C C H H H H H H H H H H H H H H H H
charge: -0.285829 -0.389027 -0.066496 -0.370734 -0.403942 0.275013 0.165642 0.418493 -0.352496 -0.351015 -0.342446 -0.221784 -0.240254 -0.378613 -0.373531 -0.227468 -0.226393 -0.220122 -0.230344 0.256877 0.230796 0.195348 0.228652 0.319458 0.275420 0.217035 0.207216 0.231658 0.229829 0.230355 0.274772 0.231711 0.230433 0.230070 0.231714
chargesum: 0.00000
title: Mulliken charges with hydrogens summed into heavy atoms:
elementType: O N N C C C C C C C C C C C C C C C C
charge: -0.285829 -0.069569 -0.066496 0.116940 0.020058 0.275013 0.165642 0.418493 -0.077075 -0.133979 -0.135231 0.009874 -0.010425 -0.148258 -0.098760 0.004243 0.004039 0.009948 0.001370
polarizability: 2.27973161e+02 3.28067292e+01 2.20673928e+02 2.28553536e+01 -7.53278008e+00 1.24981999e+02
1716.lowfreq: -13.9250 -7.8632 -3.9746 -0.0009 -0.0007 -0.0003 9.1732 14.7589 22.7108
frequency: 8.8732 14.3053 22.4898 45.4538 57.2059 73.5574 105.0333 133.7914 168.1807 197.0438 267.2101 282.5747 301.4237 340.7580 356.3818 398.8801 403.5403 405.5094 440.9750 485.4837 492.6396 542.0899 582.1524 613.9041 614.1654 624.8912 656.6433 686.2817 700.9232 703.0428 769.0585 781.0908 794.1035 840.9958 855.2717 860.4630 875.6707 907.0847 932.3302 935.9976 980.2302 984.3407 988.6058 988.9834 989.6688 1004.9865 1007.6657 1019.7283 1022.3031 1029.5593 1054.3175 1080.6029 1083.4871 1095.2026 1148.1797 1172.3761 1172.8971 1180.4008 1190.6678 1208.5956 1232.7971 1241.9977 1278.1080 1310.4723 1316.9381 1329.6015 1352.0753 1367.2506 1384.1076 1394.9364 1431.5402 1438.8817 1443.9642 1459.9390 1470.9679 1481.2273 1501.2768 1572.4666 1583.4382 1606.6055 1610.2349 1610.6918 1625.5320 2918.6142 2923.2277 3009.6187 3028.3481 3090.0904 3116.1764 3117.5159 3129.3531 3130.7699 3142.7633 3144.0092 3156.5832 3157.4860 3167.4381 3168.9406 3564.7028
redmass: 5.6105 4.1844 3.9615 5.7939 4.9575 4.9561 4.5354 4.0595 3.2395 4.4887 4.4294 3.9994 3.3922 4.7695 3.5841 3.2471 3.0840 2.8309 3.3146 3.6517 3.3274 2.1797 1.4281 6.4484 6.1588 4.9770 5.8678 4.7939 1.8110 1.5179 1.7067 2.9546 2.4462 4.2201 1.2566 1.2542 2.4423 3.0135 1.4091 1.4468 1.6420 1.4060 5.0691 1.9427 2.8547 1.3431 1.3504 2.6366 2.4201 2.7415 2.4550 1.6277 1.6005 2.2946 2.7698 1.0662 1.0589 1.1098 1.1330 1.2197 2.0480 1.3615 1.9787 1.4090 1.3350 1.2252 1.3155 1.8563 9.1092 3.6780 2.1042 2.0366 1.1953 1.1157 1.9778 2.3799 2.0796 6.5121 6.3068 6.7289 5.9932 6.1038 6.9710 1.0831 1.0674 1.0669 1.0896 1.1020 1.0874 1.0875 1.0869 1.0869 1.0918 1.0920 1.0958 1.0957 1.1009 1.1006 1.0771
irintensity: 0.3609 2.5886 0.5876 6.5977 0.3658 5.0266 1.1426 0.0144 17.5302 14.0683 2.8146 3.8576 9.6351 0.8311 16.6486 6.7853 1.4085 0.2228 9.1081 13.9376 1.0597 22.5241 106.4475 0.0383 1.4402 7.3305 5.7137 8.1794 57.6547 85.7345 47.5530 16.7480 17.4779 3.1953 0.8530 0.0907 4.5561 1.2014 1.6565 1.4929 15.8881 2.0515 0.2602 0.0560 1.5004 1.6657 2.9279 6.4968 6.1524 13.3603 4.3507 4.5967 11.0199 33.1677 9.7456 1.9782 0.9063 7.1737 7.4877 6.5053 12.1809 2.3782 183.4680 16.4619 2.9964 7.5038 13.3549 3.7371 1.5701 4.1477 1.6270 20.5998 49.7477 9.9265 87.6175 6.5617 215.9484 93.0080 14.8117 78.3271 10.8927 5.2274 57.3835 16.6093 127.1859 13.8911 61.6935 5.1125 12.3978 7.2823 0.7264 1.9992 21.7413 23.0994 20.5458 15.2040 23.2917 20.3402 14.1226
temp: 298.150 k
press: 1.00000 atm
elementType: 8 7 7 6 6 6 6 6 6 6 6 6 6 6 6 6 6 6 6 1 1 1 1 1 1 1 1 1 1 1 1 1 1 1 1
symmnumber: 1
zpe: 739836.2 jmol-1
zpe.correction: 0.281789 hartree
zpe.thermalcorrener: 0.298776 hartree
zpe.thermalcorrenthalpy: 0.299720 hartree
zpe.thermalcorrgfe: 0.232052 hartree
zpe.sumelectzpe: -802.682084 hartree
zpe.sumelectthermal: -802.665097 hartree
zpe.sumelectthermalent: -802.664153 hartree
zpe.sumelectthermalfe: -802.731821 hartree
dipole: -2.6536 -3.0616 -0.4462
dipole: 4.0760
quadrupole: -111.7578 -104.4677 -109.7254
quadrupole: -5.1004 -1.6028 -2.5821
quadrupole: -3.1075 4.1826 -1.0751 -5.1004 -1.6028 -2.5821
hfenergy: -802.9638726 hartree
pointgroup: C01 [X(C16H16N2O1)]
dipole: -1.001646 1.2515201 -0.0451368 debye
polarizability: 223.4860676|-38.6928601|215.6231125|-20.4106287|-24.8757971|134.5199082 unknown
InChI: InChI=1S/C16H16N2O/c19-16(15-9-5-2-6-10-15)18-12-11-17-13-14-7-3-1-4-8-14/h1-10,13,18H,11-12H2
charge 0 multiplicity 1
35 atoms
O  3.134156 -2.371124 -0.106717
N  1.24124 -1.454431 0.888538
N  -1.657576 -1.977357 0.610573
C  0.617316 -2.748657 1.181345
C  -0.638562 -2.999104 0.307725
C  2.939327 0.053887 -0.065873
C  2.455227 -1.346552 0.225224
C  -3.044403 -0.106587 -0.136719
C  4.321195 0.220322 -0.338556
C  2.08427 1.186918 -0.108503
C  -2.051301 -1.181656 -0.348489
C  4.845405 1.497949 -0.623587
C  2.608781 2.46573 -0.399125
C  -3.393226 0.742567 -1.221228
C  -3.658979 0.096403 1.130476
C  3.991113 2.625961 -0.65094
C  -4.336368 1.778619 -1.045291
C  -4.600175 1.129598 1.303869
C  -4.941733 1.974671 0.217537
H  1.372765 -3.527651 0.982595
H  0.32822 -2.788478 2.247492
H  -0.33853 -3.023733 -0.764954
H  -1.048751 -3.990378 0.582732
H  0.751643 -0.613417 1.195445
H  4.957821 -0.670398 -0.326418
H  1.002882 1.085005 0.046816
H  -1.658032 -1.274907 -1.386988
H  5.915475 1.615991 -0.826528
H  1.939842 3.332505 -0.437672
H  -2.924587 0.587286 -2.201535
H  -3.382886 -0.571615 1.952975
H  4.396601 3.618869 -0.875249
H  -4.599981 2.428551 -1.886873
H  -5.072584 1.280717 2.280969
H  -5.675205 2.776995 0.355734
