program: Gaussian 09
title: 000292243
version: EM64L-G09RevD.01
frameworkgroup: C1[X(C16H17N)]
method: RPBEPBE
basis: SDD
operation: Freq
keyword: #pfreq=noraman
keyword: PBEPBE/SDD
title: #p freq=noraman PBEPBE/SDD
converged: YES YES NO NO
title: Mulliken charges:
elementType: N C C C C C C C C C C C C C C C C H H H H H H H H H H H H H H H H H
charge: -0.152299 0.323906 0.398046 0.344827 -0.446284 -0.401828 -0.363919 -0.366851 0.287635 -0.646547 -0.646512 -0.424451 -0.392962 -0.752140 -0.230640 -0.233317 -0.247952 0.238570 0.250035 0.233773 0.235065 0.215675 0.234773 0.232174 0.233842 0.233620 0.215496 0.248894 0.258701 0.223005 0.223959 0.223179 0.224128 0.226398
chargesum: 0.00000
title: Mulliken charges with hydrogens summed into heavy atoms:
elementType: N C C C C C C C C C C C C C C C C
charge: -0.152299 0.323906 0.398046 0.344827 -0.207714 -0.151794 -0.130146 -0.131786 0.287635 0.036075 0.036447 -0.175556 -0.134262 -0.305176 -0.007461 -0.009189 -0.021554
polarizability: 2.86130401e+02 6.12164082e+00 1.84190628e+02 -1.49025709e+01 -4.46707609e+00 1.10667115e+02
1716.lowfreq: -13.5632 -4.0790 -0.0006 -0.0003 0.0003 5.3262 36.2766 50.8839 55.1689
frequency: 36.2640 50.8668 55.1589 84.4128 85.2915 105.0152 158.4093 172.2700 195.7981 219.3857 243.4234 277.5420 305.7449 358.8235 393.6897 408.7584 422.9912 453.4222 475.2834 502.9242 548.2333 569.0542 612.9587 626.5141 645.3219 667.3017 681.7315 706.4686 746.8008 751.2392 783.5715 808.1867 822.6931 832.0267 857.1221 909.0745 929.0238 942.9282 948.1114 960.7907 980.7425 988.9618 994.8532 995.6991 1024.4346 1056.4849 1070.4911 1087.5035 1109.0430 1109.4222 1134.9805 1152.4655 1168.6145 1171.4300 1190.9945 1209.8709 1262.6681 1307.7832 1320.0776 1332.9337 1361.3609 1369.5213 1373.5726 1417.9044 1426.4878 1434.8834 1440.2924 1458.8758 1462.9924 1474.2024 1481.7328 1492.7866 1505.8023 1527.9832 1551.4743 1578.4882 1607.2414 1608.9290 1630.9335 2935.4055 2943.7758 2999.9902 3002.7590 3093.2058 3102.1822 3103.2804 3119.9214 3127.3933 3127.7238 3133.0890 3141.0858 3149.0959 3160.1838 3162.8139 3164.8487 3204.6811
redmass: 3.5768 4.0950 3.4569 2.4835 2.6748 2.0624 2.6213 3.6041 1.1930 2.3836 4.1867 3.5163 3.3145 4.2117 3.3259 2.8829 3.0063 3.3175 3.4144 3.1921 3.3781 3.4490 5.7968 4.8711 4.5161 4.1691 1.2743 1.5763 3.2530 4.4212 1.9248 1.2532 1.9405 2.6493 1.2453 1.4002 1.4429 2.8644 1.4020 1.3426 1.4130 5.2350 1.4003 2.7343 2.3870 1.4905 1.7487 1.6518 1.2441 1.3137 1.4841 2.7734 1.6970 1.0545 1.1148 1.1459 2.9068 1.7249 1.3753 2.2058 3.2998 5.2506 6.3864 1.5227 1.5391 1.9247 1.9357 1.2174 1.0404 1.0462 2.2812 1.0889 1.1253 2.5538 6.1075 5.3738 5.0970 5.6787 6.0818 1.0369 1.0396 1.0991 1.1028 1.0959 1.0611 1.0938 1.0843 1.0880 1.0876 1.0881 1.0922 1.0961 1.0934 1.1013 1.0947 1.1140
irintensity: 0.5373 1.2926 0.1515 0.1654 4.6030 0.3810 0.5328 0.2827 0.2950 1.7006 0.3747 0.0472 3.2914 2.5051 0.6132 0.0519 0.3651 1.6858 6.0328 8.7015 9.3502 12.5934 1.4785 7.3913 5.1321 0.2386 2.4354 52.6032 3.4275 3.2321 52.5025 1.8950 72.2263 6.2187 0.7726 69.7818 3.1015 20.1081 1.9798 1.8020 0.5521 0.1051 0.1109 0.5244 13.1301 26.4902 4.0497 5.6412 0.2385 0.9520 2.1103 14.7706 2.3081 0.0131 5.1260 45.3828 31.9446 18.8276 4.0523 28.8413 164.0632 36.1400 0.4471 4.7210 8.3943 12.3892 0.2929 10.9563 0.0617 21.1467 12.9054 1.7634 34.1586 247.8812 3.3145 7.8302 63.9568 15.1341 243.9939 113.9548 111.9445 3.8890 89.6798 4.2884 3.6544 50.8088 2.5732 8.3146 2.0473 17.5173 22.3785 38.1363 27.8245 24.5639 7.9984 23.3931
temp: 298.150 k
press: 1.00000 atm
elementType: 7 6 6 6 6 6 6 6 6 6 6 6 6 6 6 6 6 1 1 1 1 1 1 1 1 1 1 1 1 1 1 1 1 1
symmnumber: 1
zpe: 741092.4 jmol-1
zpe.correction: 0.282267 hartree
zpe.thermalcorrener: 0.298076 hartree
zpe.thermalcorrenthalpy: 0.299020 hartree
zpe.thermalcorrgfe: 0.238316 hartree
zpe.sumelectzpe: -673.418650 hartree
zpe.sumelectthermal: -673.402841 hartree
zpe.sumelectthermalent: -673.401897 hartree
zpe.sumelectthermalfe: -673.462601 hartree
dipole: -3.3341 -1.3231 0.0534
dipole: 3.5874
quadrupole: -76.1483 -94.6761 -103.8551
quadrupole: 0.8664 -3.4389 0.4052
quadrupole: 15.4115 -3.1162 -12.2953 0.8664 -3.4389 0.4052
hfenergy: -673.700917 hartree
pointgroup: C01 [X(C16H17N1)]
dipole: 1.3014081 -0.458942 0.2962648 debye
polarizability: 280.5888412|-29.9383151|148.3671241|-17.3002939|-34.3157784|152.0321782 unknown
InChI: InChI=1S/C16H17N/c1-13(14-7-5-4-6-8-14)15-9-11-16(12-10-15)17(2)3/h4-12H,1H2,2-3H3
charge 0 multiplicity 1
34 atoms
N  4.228071 -0.665967 0.165964
C  0.175193 0.549356 -0.577489
C  2.90729 -0.272043 -0.07638
C  -1.216693 1.027318 -0.826191
C  1.147494 0.519991 -1.615389
C  0.604916 0.138217 0.715194
C  2.475279 0.123581 -1.383457
C  1.929243 -0.257996 0.969287
C  -2.344879 0.406767 -0.057039
C  5.209752 -0.658176 -0.924632
C  4.633306 -1.088264 1.511642
C  -3.441917 1.193899 0.390534
C  -2.363677 -0.988933 0.219902
C  -1.476653 2.010004 -1.745885
C  -4.528157 0.606093 1.074171
C  -3.450049 -1.578852 0.901499
C  -4.539186 -0.784827 1.331431
H  0.845935 0.78963 -2.63443
H  -0.110989 0.148388 1.544899
H  3.173687 0.104982 -2.224996
H  2.204585 -0.550751 1.986462
H  6.191722 -0.971798 -0.536348
H  5.326295 0.352882 -1.365998
H  4.928477 -1.354721 -1.741476
H  4.050455 -1.964849 1.861798
H  4.50474 -0.276005 2.25667
H  5.697495 -1.372467 1.501992
H  -3.424818 2.276138 0.218808
H  -1.527713 -1.611248 -0.117711
H  -0.670028 2.527948 -2.275429
H  -2.500803 2.309516 -1.992387
H  -5.359617 1.233285 1.415952
H  -3.449007 -2.657877 1.09411
H  -5.380449 -1.241823 1.864825
