program: Gaussian 09
title: 000292240
version: EM64L-G09RevD.01
frameworkgroup: C1[X(C13H13BrO2)]
method: RPBEPBE
basis: SDD
operation: Freq
keyword: #p
keyword: freq=noraman
keyword: PBEPBE/SDD
title: #p freq=noraman PBEPBE/SDD
converged: YES YES NO NO
title: Mulliken charges:
elementType: Br O O C C C C C C C C C C C C C H H H H H H H H H H H H H
charge: 0.017467 -0.282416 -0.276684 0.296234 0.309615 -0.140787 0.475440 0.262059 -0.645719 -0.400863 -0.397031 -0.848554 -0.244176 -0.241571 -0.526697 -0.521657 0.271332 0.271935 0.247956 0.253581 0.263278 0.230052 0.230781 0.229826 0.236008 0.227863 0.237050 0.239235 0.226444
chargesum: 0.00000
title: Mulliken charges with hydrogens summed into heavy atoms:
elementType: Br O O C C C C C C C C C C C C C
charge: 0.017467 -0.282416 -0.276684 0.296234 0.309615 -0.140787 0.475440 0.262059 -0.645719 -0.129532 -0.125096 -0.083738 -0.014124 -0.010791 0.167000 0.181072
polarizability: 2.40016944e+02 -1.51809089e+01 1.95822170e+02 1.08819146e+00 5.27980338e+00 7.97591514e+01
1716.lowfreq: -6.9745 -5.1836 -0.0006 -0.0006 0.0002 5.9588 55.7704 66.7891 84.0398
frequency: 55.7682 66.7789 84.0252 98.2258 123.3998 129.6602 145.4706 147.6382 163.2604 174.3795 211.6556 232.6835 252.7036 276.3319 307.5561 333.4357 334.8315 399.6664 440.0602 450.9924 502.5406 531.6906 542.1026 629.1407 634.4195 681.1940 687.4606 720.8274 785.5737 799.0448 815.8481 896.5594 904.2763 918.2935 970.1841 977.9195 999.0457 1017.2449 1026.1953 1045.6647 1064.0468 1087.7486 1109.2134 1111.2336 1146.7514 1151.2215 1160.0115 1168.7147 1250.7570 1280.2493 1330.5322 1360.2659 1386.4224 1395.1943 1421.4440 1428.1876 1437.1080 1443.6494 1457.3413 1459.3557 1460.9621 1469.3214 1470.6792 1480.6583 1494.8683 1567.1128 1574.5172 1621.9903 2961.5911 2967.8443 2985.9029 3050.4632 3061.8415 3061.8951 3111.5229 3116.1907 3122.4904 3131.0936 3147.3544 3163.3504 3171.7586
redmass: 4.3618 3.3652 2.8895 3.5800 3.2227 3.4180 1.2261 1.0504 2.1876 1.4287 3.7351 9.1649 5.2434 4.2284 4.3606 3.4703 7.5630 7.6024 5.2781 3.4523 4.8345 5.5188 4.8414 6.7164 5.6501 3.8311 4.7790 5.1377 1.5344 5.2885 3.1416 1.8078 6.3577 6.4156 8.1136 1.3592 1.3246 1.8729 2.2222 1.5133 3.4101 4.0883 1.2331 1.2415 1.3774 1.4088 1.7289 1.0971 1.8930 3.9989 3.2132 6.1459 2.9002 1.2070 3.1714 2.5575 1.4118 1.3964 1.0811 1.0538 1.1773 1.0618 1.0576 1.0659 2.9018 6.6275 8.4222 6.6205 1.0310 1.0311 1.0384 1.1042 1.0998 1.1010 1.0983 1.1013 1.1017 1.0857 1.0896 1.0945 1.0995
irintensity: 2.4144 3.7403 1.2620 3.4202 4.7141 1.1775 0.1831 0.1322 0.3042 0.5979 0.0154 0.5982 2.1109 2.6299 5.1135 6.0598 16.1126 0.7671 1.0639 4.4622 0.5544 4.8651 0.1390 14.8300 4.7118 6.0135 5.6520 41.1180 81.0133 19.2797 0.3603 0.1155 1.7145 21.0300 108.7425 1.9525 0.5733 35.2780 16.3261 2.4073 84.2126 13.4648 0.9523 0.0028 2.5119 4.9687 33.7545 0.8009 17.6929 16.8092 159.1584 16.0356 2.9849 9.3296 6.5363 0.7877 1.7405 22.2669 11.1383 11.2688 7.9003 16.8484 5.8459 9.9869 16.4059 36.7198 14.9110 0.4645 64.3914 57.7981 20.0234 35.2723 20.1758 21.2307 11.3058 25.9960 24.3120 4.8978 10.5311 11.8412 26.1725
temp: 298.150 k
press: 1.00000 atm
elementType: 35 8 8 6 6 6 6 6 6 6 6 6 6 6 6 6 1 1 1 1 1 1 1 1 1 1 1 1 1
symmnumber: 1
zpe: 588303.1 jmol-1
zpe.correction: 0.224073 hartree
zpe.thermalcorrener: 0.240101 hartree
zpe.thermalcorrenthalpy: 0.241046 hartree
zpe.thermalcorrgfe: 0.180186 hartree
zpe.sumelectzpe: -665.902112 hartree
zpe.sumelectthermal: -665.886084 hartree
zpe.sumelectthermalent: -665.885139 hartree
zpe.sumelectthermalfe: -665.945999 hartree
dipole: 1.5899 0.2194 0.1977
dipole: 1.6171
quadrupole: -95.8675 -88.1000 -107.7673
quadrupole: 1.6609 -6.2890 -8.0937
quadrupole: 1.3774 9.1449 -10.5223 1.6609 -6.2890 -8.0937
hfenergy: -666.1261849 hartree
pointgroup: C01 [X(C13H13Br1O2)]
dipole: 0.6290391 0.0431342 0.084966 debye
polarizability: 237.5604397|-18.1665122|198.3722258|3.8704718|2.4395785|79.6655998 unknown
InChI: InChI=1S/C13H13BrO2/c1-8-11(14)13(16-3)10-7-5-4-6-9(10)12(8)15-2/h4-7H,1-3H3
charge 0 multiplicity 1
29 atoms
Br -3.663711 0.610923 -0.242715
O  1.31573 2.521706 0.473006
O  -1.969928 -1.997475 -0.479884
C  1.09216 0.107326 0.121082
C  0.25587 -1.045887 -0.114155
C  0.476253 1.402212 0.226473
C  -0.916408 1.58539 0.142226
C  -1.170838 -0.8706 -0.20122
C  -1.716872 0.412618 -0.075973
C  2.508229 -0.073941 0.247116
C  0.86328 -2.335991 -0.258883
C  -1.529931 2.960275 0.295357
C  3.074917 -1.343981 0.118308
C  2.247844 -2.481477 -0.147077
C  1.796988 3.19131 -0.75424
C  -2.532735 -2.668353 0.714703
H  3.127615 0.800765 0.46767
H  0.219354 -3.193253 -0.476696
H  -2.017973 3.291728 -0.640373
H  -2.312687 2.956145 1.074872
H  -0.757756 3.691188 0.579786
H  4.15767 -1.47434 0.221514
H  2.706003 -3.469762 -0.262691
H  2.360887 2.485843 -1.394287
H  2.458144 4.002154 -0.411801
H  0.951128 3.612477 -1.331361
H  -3.10285 -3.525725 0.326531
H  -3.207078 -1.987388 1.265711
H  -1.722603 -3.018792 1.382798
