program: Gaussian 09
title: 000292230
version: EM64L-G09RevD.01
frameworkgroup: C1[X(C10H12O4)]
method: RPBEPBE
basis: SDD
operation: Freq
keyword: #pfreq=noraman
keyword: PBEPBE/SDD
title: #p freq=noraman PBEPBE/SDD
converged: NO NO NO NO
title: Mulliken charges:
elementType: O O O O C C C C C C C C C C H H H H H H H H H H H H
charge: -0.242209 -0.242209 -0.232035 -0.232035 0.291973 0.291973 0.119378 0.119378 -0.462574 -0.462574 -0.228156 -0.228156 -0.678494 -0.678494 0.278100 0.278100 0.238687 0.238699 0.238687 0.238700 0.214380 0.231127 0.231123 0.214380 0.231127 0.231123
chargesum: 0.00000
title: Mulliken charges with hydrogens summed into heavy atoms:
elementType: O O O O C C C C C C C C C C
charge: -0.242209 -0.242209 -0.232035 -0.232035 0.291973 0.291973 0.119378 0.119378 -0.184474 -0.184474 0.249230 0.249230 -0.001864 -0.001864
polarizability: 2.26890749e+02 -2.85746465e+01 1.22016190e+02 -1.48870672e-03 4.00871686e-03 6.72836231e+01
1716.lowfreq: -4.9231 -0.0007 0.0004 0.0010 5.5921 20.1754 29.7519 53.5077 84.6098
frequency: 29.7519 53.4190 84.6098 110.9212 114.7502 119.6122 162.7235 180.4201 183.1298 242.3742 242.7634 254.6317 303.9904 306.6666 378.4259 408.6039 415.9549 431.3862 438.1866 499.6612 630.3183 679.6914 681.3215 727.5177 748.4359 780.4098 803.1026 803.3207 821.2713 859.2894 869.5109 883.7804 1001.7464 1002.2490 1107.1436 1109.8593 1120.3428 1120.9626 1163.3482 1194.2030 1209.4095 1248.5211 1248.6493 1258.5722 1325.5900 1329.2770 1344.5712 1349.6463 1399.6968 1399.7399 1454.7961 1454.9468 1460.5688 1460.5712 1482.7555 1482.8614 1514.9072 1545.8347 1575.8465 1621.4420 2994.7814 2994.8767 3034.4364 3034.5075 3089.5727 3089.6057 3093.8102 3093.8307 3118.3205 3118.3293 3168.6416 3171.0412
redmass: 4.0595 4.8516 3.7197 1.7554 2.1749 3.4764 7.2082 3.7653 5.6855 1.1671 1.1781 4.5205 4.4645 7.2585 6.8763 5.5087 3.3359 7.4875 9.8927 5.5503 6.7846 4.6549 5.4219 8.9599 2.4767 5.1332 1.0964 1.0970 4.2335 1.8678 1.4207 3.1372 2.0808 2.1485 2.3936 2.3022 1.4099 1.4119 4.3491 1.4818 10.2881 1.1518 1.1511 2.9393 3.0121 1.8484 1.5510 1.7760 1.2526 1.2521 1.0885 1.0897 1.0396 1.0396 1.0559 1.0557 10.1994 10.9899 8.0574 7.3883 1.0358 1.0358 1.0585 1.0585 1.1033 1.1034 1.0982 1.0982 1.1068 1.1069 1.0915 1.0921
irintensity: 5.1820 0.0000 0.5026 0.0000 4.7745 2.4865 10.1253 0.0000 0.0000 1.4629 0.0000 0.0000 5.3697 0.0000 35.6160 6.1636 0.0681 0.0000 0.0000 0.0000 0.0000 20.6940 0.0000 1.0017 0.0000 3.0189 5.7719 0.0000 0.0000 0.0000 83.3696 66.6902 0.0000 152.0975 13.3126 0.0000 10.5180 0.0000 741.8665 0.0000 0.0000 0.0254 0.0000 56.8457 0.0000 187.2457 0.0000 20.4269 69.3719 0.0020 40.2687 0.0002 0.0079 25.4748 20.1822 0.0001 0.0000 248.5941 613.6465 0.0000 44.7943 0.0057 16.7959 0.0363 3.1234 0.0008 0.0014 49.5147 82.6328 1.5298 1.1840 0.0000
temp: 298.150 k
press: 1.00000 atm
elementType: 8 8 8 8 6 6 6 6 6 6 6 6 6 6 1 1 1 1 1 1 1 1 1 1 1 1
symmnumber: 1
zpe: 527791.0 jmol-1
zpe.correction: 0.201025 hartree
zpe.thermalcorrener: 0.215691 hartree
zpe.thermalcorrenthalpy: 0.216636 hartree
zpe.thermalcorrgfe: 0.158759 hartree
zpe.sumelectzpe: -688.054996 hartree
zpe.sumelectthermal: -688.040329 hartree
zpe.sumelectthermalent: -688.039385 hartree
zpe.sumelectthermalfe: -688.097261 hartree
dipole: 0.0000 0.0000 0.0007
dipole: 0.0007
quadrupole: -60.3893 -93.7190 -81.1625
quadrupole: 3.9441 0.0004 -0.0008
quadrupole: 18.0343 -15.2954 -2.7389 3.9441 0.0004 -0.0008
hfenergy: -688.2560208 hartree
pointgroup: C01 [X(C10H12O4)]
dipole: -0.0000023 -0.0000005 0.0002674 debye
dipolederiv: -1.9628275 0.2789704 0.0000769 -0.2425703 -0.2366643 0.0000152 -0.0000286 0.0000138 -0.2656244 -1.9628272 0.2789716 -0.0000413 -0.242569 -0.2366648 -0.0000119 -0.000007 -0.0000116 -0.2656246 -1.0362203 0.1422994 -0.0000012 0.4740757 -0.6862166 -0.0000133 -0.0000111 -0.0000096 -0.3036611 -1.0362197 0.1422989 0.0000154 0.4740748 -0.6862161 -0.0000395 0.0000697 -0.0000448 -0.303661 1.6961484 -0.2684903 -0.0000573 0.1168338 -0.1091993 -0.0000344 0.0000221 -0.0000278 0.1485514 1.6961478 -0.2684912 0.0000201 0.1168315 -0.1091989 -0.0000019 -0.0000008 -0.000014 0.1485515 1.4406994 -0.0996106 0.00003 -0.2846209 0.7313057 0.000031 0.0000072 0.0000347 0.1646053 1.4406992 -0.0996104 -0.0000283 -0.2846192 0.7313047 0.0000492 -0.0000254 0.0000521 0.1646051 -1.2150925 0.1054679 0.0000306 0.1647954 -0.0806252 0.0000152 0.0000208 0.0000009 -0.2224765 -1.2150925 0.1054684 -0.000023 0.1647966 -0.0806256 0.0000077 -0.0000046 0.0000186 -0.2224768 1.2020672 -0.1314032 -0.0000473 -0.2064239 0.3161273 0.000019 -0.0000851 0.000007 0.3372727 1.2020669 -0.1314039 0.0000315 -0.2064235 0.3161284 -0.0000249 0.0000546 -0.0000106 0.3372733 -0.1862584 -0.0692841 -0.0000031 -0.0737662 0.0098523 -0.000023 -0.0000143 -0.0000216 0.0609179 -0.1862589 -0.069284 -0.0000051 -0.0737669 0.0098522 0.0000186 0.000006 0.0000171 0.0609174 0.0551895 -0.0291675 -0.0000045 -0.0610018 0.0007247 -0.0000168 -0.0000021 -0.0000156 0.1785565 0.0551895 -0.0291675 -0.0000013 -0.0610017 0.0007247 -0.0000114 -0.000011 -0.0000092 0.1785566 -0.0584154 -0.0138344 -0.0410957 0.0667433 0.008375 -0.0702074 -0.0463278 -0.0846297 -0.0468275 -0.0583721 -0.0138274 0.0410788 0.0667545 0.008347 0.0702078 0.0463601 0.0846305 -0.0467785 -0.0584191 -0.0138393 0.0410939 0.0667385 0.0083533 0.0702158 0.046336 0.0846382 -0.046808 -0.0583679 -0.0138225 -0.0410811 0.0667593 0.0083685 -0.0701995 -0.0463524 -0.0846221 -0.0467984 -0.0985177 0.0966165 0.0000055 0.1239427 0.0016139 0.0000034 0.0000128 0.0000025 0.118444 0.1108152 0.0011356 0.016088 -0.0723712 0.0181902 -0.1042836 -0.0250141 -0.1105004 -0.0614925 0.110784 0.0011278 -0.0160827 -0.0723915 0.0181693 0.1042965 0.0250253 0.1105166 -0.0614872 -0.098517 0.0966165 0.0000086 0.1239428 0.0016137 -0.0000212 0.0000048 -0.0000202 0.118444 0.1108168 0.0011388 -0.0160893 -0.072373 0.0181607 0.1042947 0.0250023 0.1105111 -0.0614624 0.1107824 0.0011245 0.0160817 -0.0723898 0.0181992 -0.1042854 -0.0250375 -0.1105059 -0.0615167 unknown
polarizability: 227.1942512|-28.010509|121.7126873|-0.0015102|0.0040007|67.2836231 unknown
InChI: InChI=1S/C10H12O4/c1-3-13-9-5-8(12)10(14-4-2)6-7(9)11/h5-6H,3-4H2,1-2H3
charge 0 multiplicity 1
26 atoms
O  -2.740303 -0.679113 0.389068
O  2.740334 0.678929 0.389186
O  -1.78285 2.095867 0.38919
O  1.782881 -2.09605 0.388902
C  -1.413904 -0.323962 0.389102
C  1.413935 0.323779 0.38916
C  -0.946297 1.129601 0.389202
C  0.946328 -1.129784 0.389032
C  -0.49109 -1.352028 0.388992
C  0.491122 1.351845 0.389213
C  -3.883151 0.300969 0.389302
C  3.883181 -0.301154 0.389292
C  -5.143115 -0.556983 0.389272
C  5.143146 0.556796 0.389372
H  -0.830028 -2.392475 0.388882
H  0.83006 2.392292 0.389266
H  -3.799928 0.940207 1.283454
H  -3.800064 0.940453 -0.504688
H  3.799958 -0.940508 1.283362
H  3.800092 -0.940523 -0.504781
H  -6.031736 0.100337 0.389268
H  -5.184997 -1.200302 -0.506633
H  -5.185035 -1.200353 1.285138
H  6.031766 -0.100526 0.389267
H  5.185021 1.200239 -0.506444
H  5.185075 1.200041 1.285326
