program: Gaussian 09
title: 000292244
version: EM64L-G09RevD.01
frameworkgroup: C1[X(C17H19N)]
method: RPBEPBE
basis: SDD
operation: Freq
keyword: #pfreq=noraman
keyword: PBEPBE/SDD
title: #p freq=noraman PBEPBE/SDD
converged: YES YES NO NO
title: Mulliken charges:
elementType: N C C C C C C C C C C C C C C C C C H H H H H H H H H H H H H H H H H H H
charge: -0.152200 0.327892 0.266303 0.397206 0.261882 -0.408651 -0.446371 -0.363786 -0.366745 -0.334844 -0.397345 -0.405203 -0.646893 -0.646925 -0.230940 -0.240503 -0.760239 -0.248794 0.246528 0.234775 0.233522 0.232207 0.220266 0.256208 0.247932 0.233031 0.214547 0.232556 0.230970 0.214875 0.233667 0.223685 0.223650 0.252016 0.219762 0.220134 0.225825
chargesum: 0.00000
title: Mulliken charges with hydrogens summed into heavy atoms:
elementType: N C C C C C C C C C C C C C C C C C
charge: -0.152200 0.327892 0.266303 0.397206 0.261882 -0.162123 -0.211596 -0.130264 -0.134538 -0.114578 -0.141137 -0.157272 0.033242 0.032586 -0.007255 -0.016854 -0.068327 -0.022969
polarizability: 2.92816430e+02 -5.95264271e+00 2.02303412e+02 1.55805120e+01 -1.28122998e+00 1.24916397e+02
1716.lowfreq: -4.6907 -0.0006 -0.0003 0.0004 7.1145 11.7517 37.2202 48.3457 53.2565
frequency: 36.7769 48.3036 53.1528 74.0253 81.1454 92.5368 130.8469 142.6448 167.6134 200.2732 213.3974 221.7358 238.2852 242.2150 296.3915 338.4821 363.4074 409.2764 420.7517 435.0247 448.0731 478.2374 503.9613 554.1380 573.3312 611.8721 627.9016 645.3639 685.4641 707.7122 733.8792 745.8964 776.1682 807.3330 813.0113 843.7623 856.9528 889.4864 926.3053 941.8359 943.7913 957.9731 969.9385 979.6959 989.1953 993.4153 1000.7746 1027.7251 1036.3408 1055.7284 1080.6063 1110.0826 1110.7204 1111.3551 1136.2379 1162.6971 1170.5783 1172.2866 1187.8576 1210.5532 1264.1102 1277.2828 1312.1546 1318.8118 1351.7916 1360.8605 1373.2185 1376.1133 1394.3055 1425.2174 1431.6773 1439.3602 1458.9862 1462.8657 1466.6061 1469.1732 1473.9507 1483.4220 1493.7476 1506.5238 1526.5279 1552.4196 1580.6595 1609.3315 1625.1278 1634.6782 2933.3234 2941.9264 2957.9442 2996.8951 2999.7897 3024.0276 3081.5202 3091.7812 3100.9587 3102.0408 3119.3454 3125.4533 3126.7889 3132.0004 3140.3914 3148.0609 3158.4380 3162.1558 3163.2334
redmass: 3.3402 3.7792 3.7047 3.5861 2.4850 2.0184 2.4293 2.3207 1.3466 1.1397 2.9407 2.3481 3.4014 2.8474 3.4720 3.8993 4.3208 2.8699 2.9862 3.1491 3.5971 3.5135 3.3247 3.0987 3.7287 5.3641 5.3394 4.6200 4.5650 1.6502 3.3333 5.1837 2.1319 1.2623 1.5956 1.3515 1.2467 3.5152 1.4264 1.4254 2.9663 1.3487 2.2911 1.3990 5.1907 1.3760 2.6469 2.1933 1.4976 1.4863 1.5953 1.3178 1.2435 2.3048 1.4874 2.0696 1.0655 1.9129 1.1153 1.1586 2.8823 2.3488 1.3914 1.3979 2.1110 3.2992 6.7422 2.9530 1.2568 1.6333 2.2592 1.8275 1.2168 1.0404 1.0583 1.0825 1.0463 2.3156 1.0886 1.1273 2.5202 6.4198 5.8783 6.0864 6.3813 6.4377 1.0369 1.0396 1.0390 1.0990 1.1027 1.0956 1.0927 1.0958 1.0926 1.0937 1.0841 1.0878 1.0875 1.0878 1.0922 1.0964 1.0933 1.1014 1.0946
irintensity: 0.0550 1.8400 0.3507 2.8961 0.1674 2.2447 0.8405 0.0672 0.3202 0.0636 0.0915 1.5112 0.9520 2.4238 0.4984 0.8412 1.5360 0.1289 0.2593 1.5552 1.1500 6.5986 6.4341 9.8388 7.1957 3.2298 5.1170 5.2932 4.6706 56.7341 5.1861 6.1631 34.6264 4.3262 93.4801 8.5510 0.3494 7.2124 8.6891 1.2867 23.0504 1.6818 10.7557 0.1749 0.1627 0.3989 1.0771 8.9996 1.9657 25.9958 8.9436 1.1180 0.0774 2.2337 2.6638 20.7754 0.0150 0.4947 3.1161 39.2763 33.1852 15.0628 1.3873 7.6840 7.5085 140.4572 2.0668 37.9636 3.4565 5.1979 9.0047 0.4627 14.7134 0.0215 7.8077 9.8545 20.8560 13.3557 1.4258 29.9197 274.8977 4.8333 1.6720 4.6912 122.3806 127.8726 117.7080 121.0434 58.6821 6.4115 89.9657 25.7009 3.3870 4.2382 53.0681 47.7310 1.9524 8.9006 2.1938 15.6925 21.7848 40.6359 31.0295 24.4391 8.9432
temp: 298.150 k
press: 1.00000 atm
elementType: 7 6 6 6 6 6 6 6 6 6 6 6 6 6 6 6 6 6 1 1 1 1 1 1 1 1 1 1 1 1 1 1 1 1 1 1 1
symmnumber: 1
zpe: 813218.5 jmol-1
zpe.correction: 0.309739 hartree
zpe.thermalcorrener: 0.327221 hartree
zpe.thermalcorrenthalpy: 0.328166 hartree
zpe.thermalcorrgfe: 0.263750 hartree
zpe.sumelectzpe: -712.644468 hartree
zpe.sumelectthermal: -712.626985 hartree
zpe.sumelectthermalent: -712.626041 hartree
zpe.sumelectthermalfe: -712.690456 hartree
dipole: 2.8390 -0.5952 0.0101
dipole: 2.9008
quadrupole: -82.9018 -99.6587 -108.7843
quadrupole: -1.4454 3.5766 0.9561
quadrupole: 14.2131 -2.5437 -11.6694 -1.4454 3.5766 0.9561
hfenergy: -712.9542067 hartree
pointgroup: C01 [X(C17H19N1)]
dipole: -1.1082618 0.2706869 0.0306286 debye
polarizability: 288.2615935|-15.7610749|197.4944274|-27.5134611|-18.5892191|134.2802189 unknown
InChI: InChI=1S/C17H19N/c1-4-17(14-8-6-5-7-9-14)15-10-12-16(13-11-15)18(2)3/h4-13H,1-3H3
charge 0 multiplicity 1
37 atoms
N  -4.39859 0.564894 0.149665
C  -0.274531 -0.652912 0.132327
C  1.151943 -1.101567 0.092263
C  -3.054906 0.170377 0.14563
C  2.195841 -0.064399 -0.199611
C  -0.750887 0.385528 -0.715842
C  -1.22734 -1.250508 1.003969
C  -2.097438 0.789452 -0.719744
C  -2.577855 -0.860972 1.016381
C  1.471789 -2.417931 0.327187
C  2.186502 1.182182 0.48704
C  3.211115 -0.285292 -1.170542
C  -4.849261 1.642173 -0.737844
C  -5.356647 -0.099397 1.039709
C  3.17022 2.161268 0.230581
C  4.192277 0.695989 -1.435116
C  2.845494 -3.034498 0.465834
C  4.179792 1.922863 -0.732248
H  -0.050665 0.879374 -1.399228
H  -0.895427 -2.019168 1.711941
H  -2.404253 1.586232 -1.403556
H  -3.258521 -1.347979 1.720867
H  0.63429 -3.119045 0.457602
H  1.403764 1.374444 1.229392
H  3.210552 -1.223716 -1.736392
H  -4.315584 2.593616 -0.535538
H  -5.925485 1.819582 -0.583327
H  -4.696339 1.388889 -1.8075
H  -5.093414 0.035607 2.109521
H  -6.359909 0.327727 0.882926
H  -5.416626 -1.189354 0.84095
H  3.149569 3.109681 0.779739
H  4.960198 0.506052 -2.193932
H  3.642115 -2.27538 0.532714
H  3.082211 -3.701784 -0.388039
H  2.889163 -3.665109 1.375584
H  4.940643 2.68488 -0.936264
