program: Gaussian 09
title: 000292231
version: EM64L-G09RevD.01
frameworkgroup: C1[X(C12H7NO2)]
method: RPBEPBE
basis: SDD
operation: Freq
keyword: #p
keyword: freq=noraman
keyword: PBEPBE/SDD
title: #p freq=noraman PBEPBE/SDD
converged: YES YES NO NO
title: Mulliken charges:
elementType: O O N C C C C C C C C C C C C H H H H H H H
charge: -0.134109 -0.151258 0.007096 0.320153 0.475613 0.262260 -0.565915 -0.178610 -0.360179 -0.630024 -0.365023 0.062887 -0.242879 -0.227539 -0.130984 0.264595 0.254872 0.281674 0.274517 0.291528 0.243390 0.247930
chargesum: 0.00000
title: Mulliken charges with hydrogens summed into heavy atoms:
elementType: O O N C C C C C C C C C C C C
charge: -0.134109 -0.151258 0.007096 0.320153 0.475613 0.262260 -0.301320 -0.178610 -0.105307 -0.073832 -0.073494 0.062887 0.000512 0.020391 -0.130984
polarizability: 1.69079588e+02 2.05672891e+01 1.78719446e+02 -5.06960359e+00 3.71877700e+00 6.94580549e+01
1716.lowfreq: -8.6085 -4.8685 -0.0009 -0.0008 -0.0008 0.9356 46.3068 53.2827 79.6011
frequency: 46.2974 53.2728 79.5944 125.6554 185.4640 193.8080 256.2508 299.4298 344.3333 363.2961 365.3904 393.4668 409.3488 438.3893 466.1001 516.9666 530.7882 591.2700 644.6488 672.5208 702.9063 731.8832 776.7167 789.9641 832.3020 895.1920 910.5194 926.8349 943.2669 956.4345 984.5908 1012.0402 1036.0710 1058.2085 1119.7893 1177.5435 1183.9092 1197.6341 1219.8321 1250.2865 1294.3522 1302.2842 1366.8628 1386.7749 1437.7310 1451.7003 1486.2761 1554.0500 1568.4323 1579.7770 1613.0507 1622.7471 2201.1061 2993.3133 3060.5204 3141.8678 3143.0584 3152.2647 3162.4759 3175.4934
redmass: 11.0427 7.7206 7.8303 4.8607 6.7878 4.6763 4.2692 5.5956 14.4078 7.9784 3.3214 4.8481 3.7500 8.3734 7.4501 4.2279 5.7814 3.8690 5.8812 5.3495 4.6336 3.4465 2.6378 2.0581 2.1871 1.7653 2.0449 3.7959 3.1160 2.8099 1.4064 1.3851 3.6825 2.4224 2.0096 2.1544 1.0958 1.5077 1.7187 2.3190 1.7970 1.5388 2.1255 10.0380 2.3262 1.0894 2.6870 10.9721 6.9438 7.3279 7.9444 7.8713 12.4336 1.0624 1.0965 1.0862 1.0926 1.0899 1.0946 1.1007
irintensity: 0.9531 7.8540 2.9406 3.0648 0.8087 2.0856 3.2952 2.4861 3.8526 2.3494 0.0476 1.9140 5.4582 1.1129 1.8471 4.3779 7.4877 3.8415 3.2880 2.7610 1.7921 16.9997 18.5721 43.3634 4.9519 18.5003 1.9440 4.1869 5.5077 8.6682 3.5921 0.6157 0.8472 0.0089 2.8894 11.1981 0.6313 0.7586 29.3763 59.6841 53.6527 10.8983 36.2003 10.0260 5.7047 30.0717 1.2156 212.1551 45.7785 28.2466 7.7032 54.9764 5.4582 2.6401 2.2532 0.8562 3.3287 4.7401 9.2992 18.1950
temp: 298.150 k
press: 1.00000 atm
elementType: 8 8 7 6 6 6 6 6 6 6 6 6 6 6 6 1 1 1 1 1 1 1
symmnumber: 1
zpe: 408981.4 jmol-1
zpe.correction: 0.155773 hartree
zpe.thermalcorrener: 0.167838 hartree
zpe.thermalcorrenthalpy: 0.168782 hartree
zpe.thermalcorrgfe: 0.116608 hartree
zpe.sumelectzpe: -665.622061 hartree
zpe.sumelectthermal: -665.609996 hartree
zpe.sumelectthermalent: -665.609051 hartree
zpe.sumelectthermalfe: -665.661226 hartree
dipole: 3.4674 3.1510 -3.5579
dipole: 5.8831
quadrupole: -111.2624 -75.5460 -87.9375
quadrupole: -8.5691 -9.9418 3.9930
quadrupole: -19.6804 16.0360 3.6444 -8.5691 -9.9418 3.9930
hfenergy: -665.7778335 hartree
pointgroup: C01 [X(C12H7N1O2)]
dipole: 0.7296323 -1.7492831 1.3285067 debye
dipolederiv: -0.7406506 0.3091883 -0.0855586 0.0744614 -0.4637039 0.0127324 -0.1062182 0.0662771 -0.297789 -0.4678898 0.2318405 -0.0086447 0.1950662 -0.9021481 0.0006194 -0.030968 0.0281516 -0.3024112 -0.264475 -0.0092175 -0.0139457 0.0137092 -0.2077932 0.0089188 0.071036 0.0005694 -0.1825438 -0.149488 -0.1770222 -0.0277165 -0.0520019 0.0444341 -0.0214118 -0.0475401 -0.0469651 0.0038439 0.5898613 0.106847 0.0653366 0.0172466 0.6197935 0.0220127 0.1292783 0.0425755 -0.0474485 -0.1162852 0.1266919 -0.0340535 0.1695387 -0.5392673 0.0308588 -0.0295419 0.0098833 0.0267626 -0.4670239 0.5344292 0.0086194 0.1374851 -0.4155592 0.011676 -0.0613025 0.0980585 -0.1438754 0.6495282 -0.3816522 0.0944441 -0.3019486 0.8677207 -0.0479326 0.1074426 -0.0648029 0.1669427 0.1206222 -0.1098294 0.0415781 0.0553049 -0.2878515 0.0167597 0.0402557 -0.0158466 -0.1185069 0.0214231 -0.0183684 0.0304803 0.0975262 0.1077422 -0.05945 0.0255892 -0.0540468 0.0882004 0.0614575 0.0584977 0.040949 -0.1888273 -0.165603 -0.04234 0.0292019 0.010957 -0.077012 0.7769188 -0.6921263 0.0589312 -0.2095833 0.7708395 -0.016842 0.1168158 -0.1391216 0.2434068 -0.0627135 0.0284179 0.0180028 -0.0694635 0.2724554 -0.0075114 0.0162189 0.0350859 -0.1126084 -0.0754824 0.0085316 0.0232487 0.1655512 0.156863 0.0504898 0.0230692 0.0156287 -0.1350044 -0.0353119 0.012681 -0.0829501 -0.0549677 -0.0184819 0.0556103 -0.1772393 0.0411393 0.0373808 -0.0052247 -0.0588766 -0.0459258 -0.0824535 0.0267973 -0.0174688 -0.0410245 -0.0184455 0.1419836 -0.0674028 0.029418 -0.0503767 0.0305333 0.1045623 -0.012343 -0.0578992 -0.0093469 0.1289565 0.0499528 -0.0072843 0.0204417 -0.071851 -0.0104636 -0.0668375 0.0353977 -0.0168306 0.0969257 0.0587306 0.039114 0.0269773 0.0640743 0.0294093 0.092856 0.0377775 0.0455899 0.035056 0.0145646 -0.00976 -0.0322217 0.0424704 0.1074655 0.0086608 -0.0290209 -0.0041248 0.1450787 0.0756998 0.0711723 -0.0155785 0.0477849 -0.0718996 0.0064412 -0.0160537 0.0062818 0.1501399 0.033189 -0.0926925 -0.0320374 -0.0796555 -0.0253116 -0.0254991 -0.0352746 -0.0306671 0.1525221 unknown
polarizability: 155.3257468|-11.7467561|191.2880231|8.8741315|8.273724|70.6433186 unknown
InChI: InChI=1S/C12H7NO2/c13-6-5-8-7-11(14)12(15)10-4-2-1-3-9(8)10/h1-4,7H,5H2
charge 0 multiplicity 1
22 atoms
O  -3.035549 1.216509 -0.414577
O  -1.275243 3.374041 0.093677
N  3.942712 -0.677264 -1.100654
C  0.126359 -0.597642 0.264269
C  1.008954 0.560861 0.525425
C  -1.254279 -0.383542 -0.058369
C  0.53721 1.850841 0.468194
C  -1.825096 0.994577 -0.136931
C  0.604923 -1.932517 0.326707
C  2.478138 0.330109 0.892109
C  -2.107959 -1.484413 -0.306552
C  -0.860499 2.180361 0.144479
C  -0.255261 -3.024629 0.076958
C  -1.615203 -2.804398 -0.240524
C  3.281993 -0.235679 -0.211248
H  1.194958 2.706281 0.660074
H  1.655216 -2.134825 0.556674
H  2.937413 1.287672 1.194503
H  2.557652 -0.350168 1.762895
H  -3.15552 -1.278034 -0.549939
H  0.13825 -4.045185 0.126084
H  -2.279867 -3.651853 -0.435654
