program: Gaussian 09
title: 000292267
version: EM64L-G09RevD.01
frameworkgroup: C1[X(C15H24O3)]
method: RPBEPBE
basis: SDD
operation: Freq
keyword: #pfreq=noraman
keyword: PBEPBE/SDD
title: #p freq=noraman PBEPBE/SDD
converged: YES YES NO NO
title: Mulliken charges:
elementType: O O O C C C C C C C C C C C C C C C H H H H H H H H H H H H H H H H H H H H H H H H
charge: -0.288040 -0.294624 -0.460931 0.195368 0.253642 0.138296 0.382334 -0.521030 -0.123796 -0.471052 -0.514224 -0.798962 -0.420905 -0.421504 -0.749975 -0.741023 -0.313030 -0.336752 0.238494 0.226528 0.220803 0.202944 0.223904 0.241527 0.222029 0.222214 0.261041 0.212956 0.227729 0.210020 0.226439 0.200661 0.243723 0.212002 0.218732 0.214299 0.222139 0.224389 0.213277 0.235999 0.209909 0.354452
chargesum: 0.00000
title: Mulliken charges with hydrogens summed into heavy atoms:
elementType: O O O C C C C C C C C C C C C C C C
charge: -0.288040 -0.294624 -0.106479 0.195368 0.253642 0.138296 0.382334 -0.056008 0.097006 -0.044204 -0.050668 -0.102751 -0.193176 0.014955 -0.093589 -0.085854 0.124635 0.109156
polarizability: 1.79767052e+02 -7.57291998e-01 1.62741913e+02 4.74895039e+00 -5.75079575e+00 1.42944868e+02
1716.lowfreq: -16.3669 0.0004 0.0005 0.0007 4.9282 15.0052 38.7555 61.2248 89.9447
frequency: 38.6780 60.7038 89.9250 136.3204 158.8888 165.6779 178.2119 187.8497 234.3981 243.1444 244.9841 255.7420 268.4679 280.7726 301.5075 313.7298 344.5010 348.1783 355.0430 373.5058 383.1253 401.1570 431.2772 449.8321 482.1249 497.3624 535.8326 548.9520 615.8068 635.5948 665.8470 677.2323 684.8814 739.3354 771.5124 800.5034 828.9257 852.2863 859.7967 879.2218 906.8287 911.8323 919.1096 928.1156 931.8817 943.3886 964.4293 980.0178 984.6318 993.4096 1000.6085 1016.1365 1032.6087 1059.6708 1075.3970 1078.9744 1104.2729 1112.8776 1128.5617 1147.1560 1158.2887 1163.5455 1169.8003 1188.8236 1194.5328 1201.9303 1207.8601 1232.0220 1236.7311 1263.2109 1276.6538 1305.2824 1312.6276 1322.1747 1328.2254 1337.7733 1341.3182 1347.1730 1352.7046 1366.5711 1375.5490 1379.3412 1396.5306 1451.9137 1456.0761 1459.7408 1463.8485 1467.0911 1471.6615 1476.9263 1481.7377 1481.8535 1488.3162 1494.9860 1497.5841 1660.9610 2965.5547 2975.9854 2982.4785 2985.0951 2988.0445 2990.9558 2993.9259 3001.6845 3005.0791 3016.9723 3030.6920 3044.1453 3060.8776 3062.4257 3069.1619 3070.7036 3083.3183 3088.4956 3089.1528 3096.6864 3099.5176 3104.9974 3127.9104 3498.7505
redmass: 4.2040 3.7450 3.2621 2.8471 1.3017 2.3100 2.4673 2.2893 1.8371 1.9579 2.3735 3.5220 1.3530 2.2822 1.8187 2.9277 2.8769 2.1232 2.6313 3.0182 2.9030 1.3477 3.5720 3.1931 2.9060 3.1183 4.5306 3.4428 2.4134 3.7591 3.3983 2.6276 4.4439 4.2955 1.8137 1.8397 2.1131 3.1203 2.2350 1.7316 2.7871 2.2350 2.7556 2.2339 1.5462 1.9971 2.2157 2.2750 2.5759 1.8062 2.4276 1.7547 2.2679 2.1437 2.1470 1.8355 1.8798 1.8414 1.6289 2.8479 2.6031 1.1520 1.7597 2.2596 1.3231 2.5732 1.4134 1.6975 1.9753 1.7471 1.6844 1.5206 1.5242 1.3773 1.2531 1.4619 1.5099 1.4765 1.4157 1.1623 1.2197 1.2026 1.1960 1.0842 1.0744 1.0530 1.0797 1.0728 1.0792 1.0866 1.0656 1.0544 1.0611 1.0634 1.0641 7.4021 1.0605 1.0382 1.0368 1.0676 1.0357 1.0602 1.0617 1.0615 1.0931 1.0671 1.0872 1.0991 1.1013 1.0990 1.0980 1.1018 1.0998 1.0995 1.1001 1.1030 1.0987 1.0959 1.0887 1.0660
irintensity: 0.2913 1.1726 5.5166 0.7944 0.5130 1.4256 2.6754 2.3408 0.5472 1.6148 4.4404 1.8605 3.4840 3.8401 1.0730 2.5201 0.3535 30.2112 5.0684 0.5563 9.1862 60.2969 2.9342 7.3597 2.9630 18.9402 5.1948 0.9646 3.8495 8.7519 4.1305 0.5468 3.4789 3.7928 3.6049 4.4270 38.4003 6.8101 0.2026 8.6910 11.4187 30.1371 25.8040 16.3029 0.1847 7.4761 16.2939 5.1371 35.3216 10.2852 84.4389 39.5658 4.4604 5.7246 14.3909 44.2341 5.2150 20.2883 3.9956 22.2637 21.0174 0.9523 12.9192 14.6370 9.0801 2.9521 6.5013 19.7414 9.9200 29.4737 0.8360 2.0815 5.1633 0.3756 1.4859 5.4958 2.4781 4.8467 5.0260 20.0349 14.4685 28.1751 25.5761 9.9617 5.0747 3.5239 9.3467 6.3774 23.1528 9.9187 3.3432 12.4008 9.5262 7.9627 10.3490 0.8952 41.9530 22.2473 39.8141 64.9249 18.4729 35.7335 39.4076 45.9208 14.6180 45.6344 52.4719 28.9844 24.8007 0.4284 74.1794 33.8133 36.6003 19.6195 21.7053 30.1147 27.0238 28.0649 21.1570 12.0387
temp: 298.150 k
press: 1.00000 atm
elementType: 8 8 8 6 6 6 6 6 6 6 6 6 6 6 6 6 6 6 1 1 1 1 1 1 1 1 1 1 1 1 1 1 1 1 1 1 1 1 1 1 1 1
symmnumber: 1
zpe: 955724.9 jmol-1
zpe.correction: 0.364016 hartree
zpe.thermalcorrener: 0.381795 hartree
zpe.thermalcorrenthalpy: 0.382739 hartree
zpe.thermalcorrgfe: 0.320663 hartree
zpe.sumelectzpe: -810.203417 hartree
zpe.sumelectthermal: -810.185638 hartree
zpe.sumelectthermalent: -810.184694 hartree
zpe.sumelectthermalfe: -810.246770 hartree
dipole: -2.2999 0.7232 0.8103
dipole: 2.5434
quadrupole: -101.5989 -106.7828 -115.8641
quadrupole: 4.8692 10.8114 -3.2945
quadrupole: 6.4831 1.2991 -7.7822 4.8692 10.8114 -3.2945
hfenergy: -810.5674333 hartree
pointgroup: C01 [X(C15H24O3)]
dipole: 0.9173569 0.2462686 -0.3148755 debye
polarizability: 179.7187206|0.1456529|162.8558307|5.2512528|5.3023977|142.8792812 unknown
InChI: InChI=1S/C15H24O3/c1-13(2)11-5-4-7-15(17-9-10-18-15)14(11,3)8-6-12(13)16/h5,12,16H,4,6-10H2,1-3H3
charge 0 multiplicity 1
42 atoms
O  2.685108 -0.519107 -0.898825
O  1.686484 -0.137445 1.222406
O  -1.819319 -1.375354 1.820634
C  0.199505 -0.121909 -0.769002
C  1.6135 0.25992 -0.210082
C  -2.327764 0.302544 0.0254
C  -0.855748 0.785689 -0.067924
C  -0.024953 -1.65006 -0.51761
C  -2.322804 -1.207535 0.439914
C  -1.504411 -2.077345 -0.534221
C  1.933464 1.7501 -0.352745
C  0.206497 0.12533 -2.313725
C  -0.490206 2.002061 0.428131
C  0.908231 2.584386 0.446715
C  -3.154725 1.084715 1.082828
C  -3.069117 0.476592 -1.337718
C  3.315588 -1.415737 0.094198
C  3.031432 -0.713563 1.434058
H  0.39826 -1.9199 0.466305
H  0.546204 -2.213965 -1.278345
H  -3.366201 -1.56848 0.496292
H  -1.936337 -2.014441 -1.551246
H  -1.583428 -3.133992 -0.217465
H  1.911287 2.012871 -1.42477
H  2.962515 1.937164 0.003579
H  0.099973 1.194946 -2.563557
H  1.151027 -0.255115 -2.741751
H  -0.624242 -0.414592 -2.798638
H  -1.251141 2.626799 0.91114
H  0.890112 3.627883 0.072977
H  1.234131 2.645538 1.50563
H  -3.299292 2.140491 0.789187
H  -2.683456 1.048015 2.078509
H  -4.157053 0.625408 1.171344
H  -3.115642 1.5490 -1.600171
H  -4.106863 0.098613 -1.256986
H  -2.581416 -0.048929 -2.173151
H  4.387311 -1.485183 -0.153831
H  2.849875 -2.419026 0.053569
H  2.960094 -1.393634 2.297523
H  3.768041 0.087833 1.640738
H  -0.93882 -0.917785 1.890889
