program: Gaussian 09
title: 000292235
version: EM64L-G09RevD.01
frameworkgroup: C1[X(C18H11N3)]
method: RPBEPBE
basis: SDD
operation: Freq
keyword: #pfreq=noraman
keyword: PBEPBE/SDD
title: #p freq=noraman PBEPBE/SDD
converged: YES YES NO NO
title: Mulliken charges:
elementType: N N N C C C C C C C C C C C C C C C C C C H H H H H H H H H H H
charge: 0.008025 -0.002149 -0.004569 0.305515 0.295462 -0.182071 0.416784 0.016244 -0.644257 -0.410820 -0.381434 0.068970 0.052818 -0.640942 -0.233639 -0.256148 -0.338574 -0.329535 -0.217927 -0.218821 -0.131771 0.268791 0.290103 0.249619 0.279495 0.268362 0.236932 0.234488 0.263006 0.264591 0.236531 0.236921
chargesum: 0.00000
title: Mulliken charges with hydrogens summed into heavy atoms:
elementType: N N N C C C C C C C C C C C C C C C C C C
charge: 0.008025 -0.002149 -0.004569 0.305515 0.295462 -0.182071 0.416784 0.016244 -0.375465 -0.120716 -0.131814 0.068970 0.052818 -0.093085 0.003293 -0.021660 -0.075568 -0.064944 0.018604 0.018100 -0.131771
polarizability: 4.03071760e+02 -2.59660141e+01 2.24047823e+02 5.11971632e+00 9.30630865e+00 9.57850325e+01
1716.lowfreq: -6.6385 -0.0008 -0.0005 -0.0004 2.2687 8.6573 40.4255 53.2646 69.3279
frequency: 40.4049 53.2589 69.3269 89.2048 143.5017 156.2841 183.2532 195.8041 251.2543 301.9606 312.9126 333.8707 343.8106 364.2681 413.1541 428.2292 438.4364 487.2035 495.9057 515.3369 525.0771 541.9829 561.6045 572.9813 600.2431 608.3976 669.8351 686.4499 723.6978 739.1256 758.9186 774.1311 780.9813 793.1653 826.1514 832.5870 881.9151 885.7232 900.4229 902.5436 933.6448 945.5751 973.2350 977.3983 998.5582 998.9721 1006.6836 1009.5447 1036.0687 1057.5406 1120.6789 1126.6240 1158.1133 1178.0962 1184.1695 1201.5556 1226.1643 1232.1790 1263.5486 1281.3723 1294.4707 1302.7119 1327.9151 1360.7253 1392.7309 1395.9246 1408.0306 1445.7448 1452.5956 1454.9987 1467.4034 1487.0475 1510.3960 1536.1069 1555.7753 1606.3408 1615.4353 1633.1054 2198.4800 2990.2831 3055.6121 3134.9465 3136.2445 3148.4770 3149.0582 3149.4765 3162.6857 3164.3653 3173.4513 3174.0453
redmass: 8.3304 5.9520 5.7399 5.6341 4.7962 4.9823 4.8250 5.9631 3.7207 5.1791 5.5100 7.2063 5.5630 2.9882 5.7052 3.4524 5.0925 3.7889 7.1223 5.2948 4.3514 5.1863 3.7852 6.8723 5.7992 5.3478 5.4976 5.4479 4.0744 4.9166 5.2822 1.3602 1.6944 2.6275 4.9905 2.4960 3.5636 1.8358 1.9739 2.0731 3.0955 2.0695 1.3519 1.3845 5.9915 1.3308 2.1679 1.3565 3.4131 2.4125 1.6408 1.9240 1.1659 1.1760 1.2819 1.5794 1.7797 1.8841 4.3874 1.8062 2.2525 2.0110 2.3562 3.0572 2.8074 8.6842 4.1398 1.6238 1.7835 2.7204 3.5600 4.1244 6.2857 6.3126 6.5608 6.5937 6.2407 7.5171 12.4325 1.0622 1.0966 1.0857 1.0860 1.0915 1.0908 1.0894 1.0950 1.0959 1.0995 1.1006
irintensity: 2.1251 2.0482 2.8711 1.9664 2.3813 1.9387 1.3025 0.4272 3.3442 0.2046 2.4836 0.5783 0.2415 0.1769 3.9935 2.0273 5.0302 0.6619 0.9982 2.7934 1.8188 9.4845 4.7420 3.0356 2.6193 3.6338 3.2592 2.0978 5.3925 9.6341 1.9289 45.3909 101.9512 26.8603 7.0767 0.7290 4.3178 0.1653 14.9668 2.8521 0.5508 4.3200 1.7739 3.2117 11.4190 0.0132 15.5155 0.9607 2.8926 1.7722 6.6603 0.5312 4.7575 3.2643 1.4393 4.0590 2.1882 0.4086 0.0581 0.8702 2.4579 9.1860 0.6196 47.1520 22.3565 14.0028 10.0616 13.6551 10.9767 16.3631 5.0911 26.4632 5.5648 9.4264 2.8600 5.4721 8.4469 6.2541 8.9945 8.4274 2.2892 0.6282 2.6746 2.4225 17.3643 7.9310 15.5840 12.5698 33.5305 27.6079
temp: 298.150 k
press: 1.00000 atm
elementType: 7 7 7 6 6 6 6 6 6 6 6 6 6 6 6 6 6 6 6 6 6 1 1 1 1 1 1 1 1 1 1 1
symmnumber: 1
zpe: 627905.6 jmol-1
zpe.correction: 0.239157 hartree
zpe.thermalcorrener: 0.254485 hartree
zpe.thermalcorrenthalpy: 0.255429 hartree
zpe.thermalcorrgfe: 0.196143 hartree
zpe.sumelectzpe: -855.386817 hartree
zpe.sumelectthermal: -855.371489 hartree
zpe.sumelectthermalent: -855.370545 hartree
zpe.sumelectthermalfe: -855.429830 hartree
dipole: 2.4567 1.3322 -2.8281
dipole: 3.9760
quadrupole: -110.6546 -111.9777 -128.4448
quadrupole: -7.5198 16.5844 7.8577
quadrupole: 6.3711 5.0480 -11.4191 -7.5198 16.5844 7.8577
hfenergy: -855.6259738 hartree
pointgroup: C01 [X(C18H11N3)]
dipole: 0.970369 0.6022624 -1.0689285 debye
polarizability: 402.8413438|-27.0540567|222.1493036|3.6046008|18.7711487|97.9139682 unknown
InChI: InChI=1S/C18H11N3/c19-10-9-12-11-17-18(14-6-2-1-5-13(12)14)21-16-8-4-3-7-15(16)20-17/h1-8,11H,9H2
charge 0 multiplicity 1
32 atoms
N  1.517653 1.221229 0.173831
N  1.617364 -1.616819 -0.360726
N  -4.869574 -2.166791 1.310529
C  -0.916971 1.170848 -0.020257
C  -2.117088 0.410637 -0.255792
C  0.384764 0.501633 -0.049385
C  -2.019587 -1.02495 -0.527116
C  0.438478 -0.930735 -0.31895
C  -0.789598 -1.652594 -0.554152
C  -1.00308 2.567367 0.237437
C  -3.370959 1.091858 -0.219507
C  2.715149 0.541521 0.136428
C  2.765993 -0.891531 -0.132925
C  -3.278647 -1.847279 -0.811748
C  -2.247812 3.213794 0.265582
C  -3.437606 2.470391 0.036651
C  3.936495 1.254886 0.366274
C  4.035987 -1.55571 -0.161483
C  5.156097 0.579408 0.331706
C  5.206114 -0.832645 0.06671
C  -4.159856 -2.016604 0.363532
H  -0.697122 -2.725254 -0.753169
H  -0.070855 3.112157 0.41157
H  -4.301217 0.537736 -0.37764
H  -2.98999 -2.852766 -1.16623
H  -3.873361 -1.383259 -1.62304
H  -2.304926 4.288843 0.466016
H  -4.410333 2.972846 0.064734
H  3.872313 2.328784 0.5666
H  4.045778 -2.630865 -0.365009
H  6.089541 1.124717 0.508073
H  6.176654 -1.339954 0.045552
