program: Gaussian 09
title: 000292227
version: EM64L-G09RevD.01
frameworkgroup: C1[X(C9H7NO5)]
method: RPBEPBE
basis: SDD
operation: Freq
keyword: #pfreq=noraman
keyword: PBEPBE/SDD
title: #p freq=noraman PBEPBE/SDD
converged: YES YES NO NO
title: Mulliken charges:
elementType: O O O O O N C C C C C C C C C H H H H H H H
charge: -0.181576 -0.387582 -0.235495 -0.200248 -0.190580 0.024718 0.317095 0.143655 -0.465998 0.374218 -0.330428 -0.601736 -0.350266 -0.214635 0.214966 0.328753 0.284345 0.254916 0.287470 0.293590 0.248031 0.386788
chargesum: 0.00000
title: Mulliken charges with hydrogens summed into heavy atoms:
elementType: O O O O O N C C C C C C C C C
charge: -0.181576 -0.000794 -0.235495 -0.200248 -0.190580 0.024718 0.317095 0.143655 -0.137246 0.374218 -0.042958 -0.062475 -0.056676 0.033396 0.214966
polarizability: 1.72624885e+02 -5.72164536e+00 1.37416675e+02 -5.17164209e+00 -1.71850823e+00 6.21838180e+01
1716.lowfreq: -5.6708 -5.4283 0.0008 0.0008 0.0009 6.3173 19.8253 36.0076 50.5546
frequency: 19.7231 35.9899 50.5510 75.7760 126.3417 135.0704 149.8865 189.2025 250.3332 304.0945 379.3194 414.3048 418.8677 447.8350 473.8713 492.4575 516.9380 559.7587 602.2398 646.6676 650.4829 685.5690 698.9514 712.9138 760.3929 821.0865 841.5102 876.0173 937.7263 957.1661 980.8564 988.5328 1010.5273 1021.1690 1069.1191 1083.5230 1097.8085 1167.3520 1189.6005 1214.8153 1246.2517 1265.5216 1291.8669 1331.7328 1379.1021 1394.7838 1433.8567 1447.8331 1477.2272 1573.1033 1603.4585 1614.0811 1648.7195 3045.4900 3129.9164 3151.4444 3167.0481 3176.2971 3186.7808 3511.5437
redmass: 8.5403 10.7393 13.2321 7.1825 7.6167 8.1252 5.8841 4.8912 6.0066 9.2398 7.5749 3.1784 2.8166 5.0097 6.0662 4.3593 5.4972 3.4545 2.6747 2.3186 4.7972 2.4086 4.3373 8.0213 6.5941 1.6726 4.5963 4.9010 2.2164 1.4571 1.4775 5.3017 1.3963 2.6431 1.8671 2.4723 1.6585 1.4618 1.2392 4.9944 2.7754 1.3791 1.4510 2.0973 11.1417 7.4514 2.8917 1.1128 2.4931 7.1951 8.3581 7.3084 8.3926 1.0594 1.1034 1.0891 1.0941 1.0922 1.0973 1.0641
irintensity: 0.7611 1.8728 0.7199 4.5801 0.6013 2.6783 0.7668 0.7508 2.4614 2.0364 3.5186 2.1688 2.3397 2.1180 5.7654 7.9895 15.9831 46.5179 108.4033 56.6776 55.3871 18.1672 32.9379 7.2342 11.9669 34.3678 5.0769 8.9140 48.6324 7.6204 34.6552 0.1774 2.5831 38.4960 117.0096 200.8283 34.3479 115.3625 49.0886 289.3562 84.8131 11.6235 28.0960 50.9526 101.9023 2.3364 20.6388 26.6077 12.8546 111.1741 138.1634 54.0779 127.8431 2.1313 0.8972 5.2566 7.1414 11.0615 2.7723 41.9670
temp: 298.150 k
press: 1.00000 atm
elementType: 8 8 8 8 8 7 6 6 6 6 6 6 6 6 6 1 1 1 1 1 1 1
symmnumber: 1
zpe: 395547.7 jmol-1
zpe.correction: 0.150656 hartree
zpe.thermalcorrener: 0.163921 hartree
zpe.thermalcorrenthalpy: 0.164865 hartree
zpe.thermalcorrgfe: 0.108128 hartree
zpe.sumelectzpe: -776.871337 hartree
zpe.sumelectthermal: -776.858073 hartree
zpe.sumelectthermalent: -776.857129 hartree
zpe.sumelectthermalfe: -776.913865 hartree
dipole: 4.3877 3.6899 -0.9964
dipole: 5.8190
quadrupole: -95.8777 -93.0480 -80.0120
quadrupole: -6.1982 4.1047 -0.8605
quadrupole: -6.2318 -3.4021 9.6339 -6.1982 4.1047 -0.8605
hfenergy: -777.0219935 hartree
pointgroup: C01 [X(C9H7N1O5)]
dipole: -1.4279492 1.7233105 -0.4819788 debye
dipolederiv: -0.6990542 -0.0402287 0.0688191 -0.1123732 -0.7394614 0.3287252 0.1715838 0.2017443 -0.4225619 -0.9801329 -0.343123 -0.1229107 -0.5335549 -0.6476424 -0.1964353 -0.2829581 -0.1949324 -0.3255108 -0.6032267 -0.1064326 -0.094199 -0.2248439 -0.7060706 0.1543485 -0.1362699 0.3648147 -0.6927934 -0.8697365 -0.0404542 0.1304838 0.0481749 -0.4383868 0.0932375 0.1028531 0.1060862 -0.292077 -0.5292984 0.1071289 0.003813 0.1081305 -0.6909241 0.2067496 0.0113254 0.1998991 -0.3115507 1.5011227 -0.2791088 -0.1029709 -0.40726 1.0516673 -0.3364415 -0.0689819 -0.3443215 0.3635214 -0.6954042 -0.0545641 0.1226586 -0.0026028 -0.2109852 0.09023 0.1568305 0.0901531 -0.0776466 1.8061431 -0.0547048 -0.1225116 -0.0779064 0.8521306 -0.4483175 -0.3763315 -0.2814931 0.2845755 0.1803504 -0.0573871 -0.0116869 -0.0782292 -0.051802 0.0022112 -0.0225995 0.0132667 -0.0478443 -0.3725499 0.1556888 0.0002623 0.1883569 -0.1746167 0.0682289 -0.0050715 0.0741957 0.0201339 0.1505017 -0.0563518 -0.0202776 0.150173 0.0095149 -0.0631231 -0.0745058 -0.0576534 -0.0417362 -0.6318523 0.2422322 -0.2615066 0.3270964 -0.1283424 0.1594083 -0.3417623 0.1493081 -0.2612515 0.0513738 0.0258799 -0.0399043 -0.2243339 0.0619654 -0.0282266 0.0781775 -0.0701421 -0.0623637 -0.4154085 0.0733582 0.004743 0.1011145 0.1342455 -0.1356299 0.0037148 -0.1513359 -0.067623 1.0868718 0.513311 0.377683 0.7748624 0.9651055 -0.1293442 0.7556116 -0.3621793 1.0763498 0.1871045 -0.0131263 0.0112791 0.0105349 0.1149787 0.0228118 -0.0014703 0.0261002 0.1539753 0.0351178 -0.0148743 0.0468543 -0.0493278 0.0859257 0.0424061 0.0320758 0.0207415 0.0649951 0.1092017 -0.0599403 -0.0307112 -0.0473993 -0.0150617 -0.0532629 -0.0441042 -0.0050627 0.0884391 0.1331361 0.0652161 0.016689 0.0603512 0.1007237 0.00826 0.0327084 0.0239819 0.1344917 0.0669859 -0.0395622 0.0367986 -0.0101728 0.142124 0.0150196 0.0247435 0.0218838 0.1547725 0.0738072 -0.0011359 0.0129347 -0.0123018 -0.0309562 0.0852069 0.0206413 0.0888381 0.1108393 0.414947 -0.021821 -0.0263397 0.0115115 0.315868 0.1139373 -0.0362108 0.0861069 0.1508655 unknown
polarizability: 173.1692413|-4.5140727|120.7748662|-6.4171525|-30.4069763|78.281271 unknown
InChI: InChI=1S/C9H7NO5/c11-8(5-9(12)13)6-2-1-3-7(4-6)10(14)15/h1-4,12H,5H2
charge 0 multiplicity 1
22 atoms
O  -1.640983 -1.448032 1.31814
O  -4.321552 -0.173377 -0.860166
O  -3.079033 1.713639 -1.396782
O  4.48337 -0.527993 -0.227605
O  3.1980 -2.132032 0.760949
N  3.353614 -0.982547 0.200011
C  -0.233913 0.241321 0.330732
C  -1.54644 -0.287399 0.839707
C  0.90856 -0.58657 0.485273
C  2.151661 -0.117498 0.032204
C  -0.098767 1.516028 -0.284596
C  -2.797649 0.629823 0.815141
C  2.30632 1.148133 -0.578812
C  1.16488 1.959273 -0.735496
C  -3.380065 0.814166 -0.57888
H  0.813926 -1.571351 0.952141
H  -3.549779 0.150365 1.458693
H  -2.54142 1.62709 1.210093
H  -0.975619 2.151467 -0.442888
H  3.297008 1.466138 -0.914328
H  1.257573 2.939029 -1.213734
H  -4.672592 -0.053071 -1.784696
