program: Gaussian 09
title: 000292217
version: EM64L-G09RevD.01
frameworkgroup: C1[X(C10H11NO)]
method: RPBEPBE
basis: SDD
operation: Freq
keyword: #p
keyword: freq=noraman
keyword: PBEPBE/SDD
title: #p freq=noraman PBEPBE/SDD
converged: YES YES NO NO
title: Mulliken charges:
elementType: O N C C C C C C C C C C H H H H H H H H H H H
charge: -0.274662 -0.616436 0.044136 -0.542333 -0.542613 0.370818 0.189166 -0.413948 -0.413541 -0.226001 -0.225696 -0.241098 0.239937 0.275663 0.275666 0.240171 0.251489 0.251236 0.327444 0.341066 0.229397 0.229317 0.230821
chargesum: 0.00000
title: Mulliken charges with hydrogens summed into heavy atoms:
elementType: O N C C C C C C C C C C
charge: -0.274662 0.052073 0.044136 -0.026733 -0.026775 0.370818 0.189166 -0.162459 -0.162305 0.003396 0.003621 -0.010277
polarizability: 1.45407108e+02 9.54072756e+00 8.62019931e+01 -2.13351366e-01 7.65886121e-01 1.01920831e+02
1716.lowfreq: -15.3329 -7.5870 -5.5539 -0.0004 -0.0003 0.0006 30.1292 59.3184 91.7821
frequency: 29.9333 59.1670 91.7761 161.4737 226.1774 261.5958 284.2472 347.3654 404.6334 424.6251 444.9981 535.8665 538.7969 583.3513 594.6159 615.2157 671.4262 707.4977 724.3862 768.3917 796.4019 832.3498 858.8777 878.8885 919.2862 949.5899 956.0074 982.7187 990.2680 997.9946 1022.2665 1054.9911 1071.2191 1076.4451 1091.9687 1097.8917 1172.4672 1180.4180 1184.1827 1209.3631 1312.7801 1335.7825 1353.6019 1371.1591 1422.9916 1432.2062 1447.2024 1485.0675 1575.7758 1583.9936 1609.5059 1629.9051 3098.6910 3105.7714 3122.2221 3125.8790 3138.1367 3147.7587 3164.2698 3205.7608 3221.7514 3516.2429 3671.9751
redmass: 4.0078 5.5172 4.6444 3.6408 3.9728 2.1439 3.6966 7.5681 2.8350 3.3475 3.1896 1.1687 3.3680 4.0526 1.2343 6.0956 4.5726 1.7261 5.1120 1.9567 1.1578 1.6766 1.3052 6.6362 1.7272 3.2814 1.1818 1.3812 6.0956 1.3125 2.3513 1.8273 1.2279 1.5277 1.3996 1.9447 1.0542 1.2872 1.1190 3.1420 1.3598 3.1852 4.4366 7.5898 1.0879 2.1999 1.3004 2.4909 1.5370 6.0695 6.1089 3.1714 1.0502 1.0612 1.0848 1.0877 1.0921 1.0965 1.1015 1.1175 1.1162 1.0443 1.1046
irintensity: 0.2506 9.5058 0.2988 0.1905 7.2657 0.0036 0.4122 10.8096 0.0510 9.3185 1.5500 151.4677 25.3067 7.8556 49.3379 2.4697 0.7833 56.7531 26.0839 21.8243 0.1748 13.6674 1.2243 0.8317 4.1722 29.1601 0.1302 0.2884 0.0790 0.3538 11.1738 0.1179 21.3473 14.4776 1.5318 2.4796 0.0258 0.6477 0.2853 11.1745 0.6486 14.0047 187.5766 0.0293 13.3112 7.5281 19.9614 15.5232 143.1275 1.4501 21.4109 222.0356 11.0655 8.1591 3.9730 0.0412 12.5599 36.0162 20.9176 0.0552 7.8132 28.7191 46.6979
temp: 298.150 k
press: 1.00000 atm
elementType: 8 7 6 6 6 6 6 6 6 6 6 6 1 1 1 1 1 1 1 1 1 1 1
symmnumber: 1
zpe: 489736.6 jmol-1
zpe.correction: 0.186531 hartree
zpe.thermalcorrener: 0.197231 hartree
zpe.thermalcorrenthalpy: 0.198175 hartree
zpe.thermalcorrgfe: 0.149313 hartree
zpe.sumelectzpe: -516.762459 hartree
zpe.sumelectthermal: -516.751759 hartree
zpe.sumelectthermalent: -516.750814 hartree
zpe.sumelectthermalfe: -516.799677 hartree
dipole: 3.9617 0.7954 0.0104
dipole: 4.0407
quadrupole: -80.2503 -65.8741 -65.6495
quadrupole: 2.8579 -0.1405 0.1465
quadrupole: -9.6590 4.7172 4.9418 2.8579 -0.1405 0.1465
hfenergy: -516.9489895 hartree
pointgroup: C01 [X(C10H11N1O1)]
dipole: -1.5162156 -0.3659589 -0.307345 debye
dipolederiv: -1.2332439 -0.0660392 -0.0571304 0.0751994 -0.5074502 -0.1271107 0.0616885 -0.1267281 -0.4627665 -0.4139989 -0.1438977 -0.121674 -0.1889203 -0.8700917 -0.2395365 -0.1584325 -0.2401869 -0.7893093 -0.1247152 0.07748 0.0646595 0.1715035 -0.2863269 -0.3500124 0.1435115 -0.3521842 -0.1702844 -0.0176195 0.031322 0.0287659 -0.0908923 -0.0698627 0.0261373 -0.0289947 0.2012146 0.0932335 -0.0182701 0.0346374 0.0282608 -0.043019 0.1264281 0.1700031 -0.0842817 -0.0042578 -0.1008108 0.405992 0.0819697 0.0729356 0.0871706 -0.0893407 -0.0609493 0.078426 -0.0597054 -0.0680266 1.2993068 0.0028202 0.0024019 -0.0539813 0.956401 0.6641123 -0.0446136 0.6630063 0.7247503 -0.1624415 -0.0505077 0.0431486 -0.0516017 -0.0849813 -0.0683545 0.0856377 -0.0922883 -0.014409 -0.1608535 0.036404 -0.0583688 0.0774969 -0.0389557 -0.0967372 -0.0661637 -0.0747472 -0.059121 0.0108942 0.073927 -0.0426138 0.0828036 -0.0238616 -0.1118154 -0.0349553 -0.1109819 -0.0257091 0.0092215 -0.0313771 0.079845 -0.0227068 -0.056972 -0.1062568 0.0865553 -0.1072681 0.0094588 0.0494247 0.0509174 0.0442215 0.0386233 -0.1151631 -0.0413349 0.0340525 -0.0407382 -0.1027781 0.016167 0.0956453 -0.010226 0.0951548 -0.0266504 0.0100539 0.0326569 0.0200938 0.0851976 -0.0164941 -0.0697846 0.0448451 -0.0183761 0.06031 0.0261185 0.0396173 0.0360545 0.0804796 -0.0161813 0.0338164 -0.0765178 0.036475 0.088828 0.0315887 -0.0253307 0.0214765 0.0498911 0.0158221 0.0056654 0.0959543 0.0479264 0.0862047 0.0006612 0.088835 -0.0094114 -0.0278843 0.0516286 0.0419713 -0.0849725 0.0331596 0.0849785 0.0670815 -0.0780868 0.0793835 0.0083101 0.0505718 -0.0782098 0.0543572 -0.0720536 0.0318132 0.0869049 0.0447917 0.0746067 0.0626898 0.1400487 0.0017229 0.0010976 -0.0062421 0.2571699 -0.0889845 -0.0052632 -0.0884172 0.2890926 0.1824008 -0.0226725 -0.0175292 -0.0863385 0.2523946 -0.0292649 -0.07326 -0.0264714 0.2634503 0.0237669 -0.0812956 0.0416364 -0.0947243 0.0298506 0.1070885 0.0527656 0.1108543 0.0446739 0.0248927 0.0291188 -0.085843 0.0381047 0.0754114 0.1046969 -0.1009329 0.1009235 -0.0021098 -0.1163196 -0.0536336 -0.047254 -0.0547618 0.1198663 0.0259104 -0.0482231 0.0257723 0.1119813 unknown
polarizability: 142.693865|11.740066|94.675045|10.3263267|-6.4966108|96.1610224 unknown
InChI: InChI=1S/C10H11NO/c11-9(12)10(6-7-10)8-4-2-1-3-5-8/h1-5H,6-7,11H2
charge 0 multiplicity 1
23 atoms
O  3.399528 -0.394105 -0.092471
N  1.607864 -1.522636 -1.041866
C  1.147769 0.336053 0.517981
C  1.646555 1.782895 0.751333
C  1.639086 0.797527 1.911982
C  -0.322651 0.085064 0.294652
C  2.145636 -0.546851 -0.222626
C  -1.027244 -0.85268 1.095567
C  -1.019392 0.743594 -0.753014
C  -2.394201 -1.12214 0.859439
C  -2.386572 0.477125 -0.991126
C  -3.078377 -0.458595 -0.186389
H  0.890973 2.573955 0.739074
H  2.617985 2.033726 0.317383
H  2.605818 0.402956 2.23578
H  0.880337 0.918197 2.690787
H  -0.497477 -1.362185 1.909257
H  -0.483834 1.471311 -1.374235
H  2.247621 -2.131183 -1.550783
H  0.600777 -1.642013 -1.140692
H  -2.925404 -1.844774 1.489201
H  -2.911795 0.997462 -1.800084
H  -4.139106 -0.664302 -0.368553
