program: Gaussian 09
title: 000292236
version: EM64L-G09RevD.01
frameworkgroup: C1[X(C17H20N2O2)]
method: RPBEPBE
basis: SDD
operation: Freq
keyword: #p
keyword: freq=noraman
keyword: PBEPBE/SDD
title: #p freq=noraman PBEPBE/SDD
converged: YES YES NO NO
title: Mulliken charges:
elementType: O O N N C C C C C C C C C C C C C C C C C H H H H H H H H H H H H H H H H H H H H
charge: -0.212797 -0.214377 -0.066588 0.017050 0.210734 -0.163338 -0.171185 -0.501903 0.293935 -0.509034 -0.612642 -0.519669 -0.423070 0.302293 -0.238379 -0.206455 -0.538592 -0.634763 -0.366991 0.372067 -0.419020 0.242802 0.221407 0.247557 0.208675 0.232899 0.206555 0.235872 0.242525 0.256422 0.209447 0.218675 0.204631 0.203574 0.204322 0.294989 0.188308 0.222353 0.229732 0.245704 0.286274
chargesum: 0.00000
title: Mulliken charges with hydrogens summed into heavy atoms:
elementType: O O N N C C C C C C C C C C C C C C C C C
charge: -0.212797 -0.214377 -0.066588 0.017050 0.210734 0.079465 0.050222 -0.045671 0.293935 -0.069580 -0.134244 -0.053801 0.000236 0.302293 -0.034805 -0.002134 -0.243603 0.005629 -0.121286 0.372067 -0.132746
polarizability: 2.75042235e+02 8.91890516e+00 2.03654730e+02 6.89962636e+00 1.72157764e+01 1.35491483e+02
1716.lowfreq: -2.7328 -0.0003 0.0007 0.0008 9.4210 12.8245 45.8525 49.4685 89.2190
frequency: 45.7757 49.4683 89.2119 100.5807 125.5175 138.1688 167.5419 182.3854 226.8558 242.9769 256.7623 276.6580 283.1594 296.9428 320.1752 351.8357 361.5212 385.9746 392.2703 406.3729 432.1206 453.3127 502.3775 508.6102 538.9607 556.1282 587.4614 614.3004 628.0361 664.4449 678.8210 686.2171 701.8756 720.9535 738.4635 762.0157 794.8460 828.8802 838.3542 848.6706 882.9828 917.3295 927.1630 939.0017 947.3855 962.8495 975.1440 985.4184 986.1717 992.1136 1006.2810 1045.5538 1065.1986 1073.9322 1080.3590 1092.2431 1111.7236 1115.5622 1119.3057 1131.4977 1151.8411 1167.4664 1180.5040 1188.3290 1195.1262 1203.3436 1212.1188 1223.8012 1231.8485 1239.8065 1264.8018 1278.2728 1283.5803 1303.4355 1317.2261 1329.0153 1332.2267 1343.8021 1353.3521 1358.5313 1363.2088 1375.4386 1379.0777 1393.6414 1417.5158 1433.5712 1441.2087 1453.8172 1458.4758 1464.3243 1472.7313 1480.0184 1482.7337 1497.1548 1585.1332 1607.3777 1682.5431 2855.4154 2865.5898 2949.8182 2954.0266 2960.7465 2969.4722 2986.4798 2991.3525 2997.4127 3002.2110 3008.8064 3012.6972 3013.3716 3057.5729 3068.8720 3095.2238 3126.7850 3128.4193 3178.2613 3184.9836
redmass: 5.0854 10.5969 4.3725 3.3014 5.5188 2.7946 3.1945 3.5150 1.6083 2.0647 2.3741 4.2389 2.8476 2.5776 3.0361 3.8538 3.6532 2.8881 2.3497 3.4724 4.0451 3.0000 3.5508 4.6657 4.1660 4.8815 4.4130 5.8000 2.6305 2.0685 5.0410 1.9823 5.6221 3.5961 4.7468 3.0568 3.3901 2.1782 2.0837 2.1215 2.1643 3.4250 1.7827 1.7064 2.5178 1.7983 1.3473 1.6476 1.7979 2.2557 2.4469 2.0782 2.1864 1.7755 2.1412 2.0714 2.1148 2.3476 1.5260 2.1854 1.6072 1.4711 1.1938 1.8851 1.2351 1.8980 4.4294 1.6711 1.7478 1.5825 1.6398 1.6594 1.4067 1.6113 1.3560 1.6816 1.5127 1.6468 1.5098 1.5433 5.3109 1.5430 1.5702 5.7334 3.8115 1.1752 1.1440 1.0944 1.1053 1.0698 1.1127 1.6105 1.3449 1.0643 7.7416 7.1932 6.3745 1.0639 1.0633 1.0606 1.0599 1.0642 1.0843 1.0837 1.0664 1.0952 1.0973 1.0728 1.0913 1.0907 1.1011 1.1006 1.0838 1.0994 1.0903 1.0905 1.0948
irintensity: 1.3848 0.0261 0.4590 0.8839 1.0599 1.1461 0.2428 0.7049 0.0911 0.5553 3.7056 2.2699 2.4506 1.2777 0.9148 1.7591 0.8702 2.0694 0.7135 1.5682 0.6153 6.1991 0.9780 0.9954 3.4024 1.0372 2.7691 3.6475 11.0807 23.5444 3.6548 39.7250 10.2299 4.0407 6.6386 9.0761 1.9464 11.8036 15.5287 3.0377 1.6371 4.7678 2.5139 16.0717 7.1024 6.5892 3.8561 2.7409 6.3604 8.8325 12.0903 4.5395 8.4224 15.3126 2.8955 10.0404 16.0604 4.3130 10.4630 1.8274 54.4421 4.7250 20.6544 27.9321 15.6540 2.8453 356.0833 24.4964 54.1095 3.6320 11.1976 7.7874 3.1537 12.3758 4.7893 4.6923 7.4238 1.4763 2.4124 14.2789 94.2651 8.6419 0.4435 1.9504 26.5465 4.5688 21.5623 10.9113 5.9510 15.1649 7.2774 22.5252 16.2765 7.5009 26.9631 15.8845 6.8960 63.5349 159.9510 27.1396 23.0228 11.2421 19.7374 56.6456 8.7521 12.9617 55.5595 60.0689 46.8962 20.9444 31.1895 30.0820 7.5355 74.7626 10.3364 1.0800 1.8929
temp: 298.150 k
press: 1.00000 atm
elementType: 8 8 7 7 6 6 6 6 6 6 6 6 6 6 6 6 6 6 6 6 6 1 1 1 1 1 1 1 1 1 1 1 1 1 1 1 1 1 1 1 1
symmnumber: 1
zpe: 889400.4 jmol-1
zpe.correction: 0.338755 hartree
zpe.thermalcorrener: 0.356139 hartree
zpe.thermalcorrenthalpy: 0.357083 hartree
zpe.thermalcorrgfe: 0.294529 hartree
zpe.sumelectzpe: -918.118536 hartree
zpe.sumelectthermal: -918.101152 hartree
zpe.sumelectthermalent: -918.100208 hartree
zpe.sumelectthermalfe: -918.162762 hartree
dipole: -5.8123 -2.8697 -1.1701
dipole: 6.5869
quadrupole: -153.6342 -117.2883 -121.7280
quadrupole: -4.2470 -2.9365 1.5579
quadrupole: -22.7507 13.5952 9.1555 -4.2470 -2.9365 1.5579
hfenergy: -918.4572905 hartree
pointgroup: C01 [X(C17H20N2O2)]
dipole: 2.2297311 1.2378936 -0.4602163 debye
polarizability: 274.0327735|12.5445109|204.3000231|-5.2126586|-18.3057332|135.8556508 unknown
InChI: InChI=1S/C17H20N2O2/c1-18-9-8-17-7-3-2-4-14(17)16(18)10-12-5-6-13(19(20)21)11-15(12)17/h2-3,5-6,11,14,16H,4,7-10H2,1H3
charge 0 multiplicity 1
41 atoms
O  -5.270441 0.0033 0.07544
O  -4.119243 -1.832607 0.785341
N  2.525181 1.561063 0.749804
N  -4.16931 -0.642193 0.282044
C  0.876499 -0.786742 0.108791
C  1.988668 -0.257083 -0.854896
C  2.128298 1.273366 -0.655071
C  1.299295 -0.44711 1.578519
C  -0.449876 -0.059083 -0.187495
C  0.718938 -2.32805 -0.056597
C  0.822903 1.970856 -1.139401
C  3.349147 -0.968922 -0.66487
C  1.580933 1.056371 1.773372
C  -0.46234 1.2580 -0.740166
C  2.037131 -3.067735 -0.181725
C  3.219628 -2.460231 -0.457823
C  -1.684548 -0.663363 0.145562
C  2.9573 2.946687 0.9935
C  -1.701038 1.920911 -0.951013
C  -2.895128 0.021644 -0.075449
C  -2.928128 1.320901 -0.626508
H  1.64423 -0.437158 -1.89479
H  2.961082 1.640569 -1.288744
H  2.202849 -1.031317 1.830797
H  0.496606 -0.759401 2.274296
H  0.091969 -2.545348 -0.947654
H  0.161477 -2.740934 0.808981
H  0.791568 3.019596 -0.782869
H  0.85594 2.034223 -2.247081
H  3.880466 -0.502504 0.190635
H  3.982313 -0.7708 -1.554345
H  2.039034 1.217467 2.768307
H  0.617462 1.625973 1.771352
H  2.001587 -4.157818 -0.049544
H  4.136338 -3.06181 -0.528731
H  -1.733902 -1.665822 0.577364
H  2.128753 3.698699 0.976275
H  3.702059 3.244196 0.233005
H  3.439086 3.012632 1.986435
H  -1.693464 2.930899 -1.377987
H  -3.886423 1.821481 -0.784562
