program: Gaussian 09
title: 000292222
version: EM64L-G09RevD.01
frameworkgroup: C1[X(C10H7NO3)]
method: RPBEPBE
basis: SDD
operation: Freq
keyword: #p
keyword: freq=noraman
keyword: PBEPBE/SDD
title: #p freq=noraman PBEPBE/SDD
converged: NO YES NO YES
title: Mulliken charges:
elementType: O O O N C C C C C C C C C C H H H H H H H
charge: -0.356190 -0.413090 -0.328888 0.005282 0.224750 0.510792 0.100870 -0.424593 -0.328873 -0.589074 -0.065540 -0.313587 0.308356 -0.361523 0.243032 0.287134 0.240361 0.261580 0.265853 0.369301 0.364047
chargesum: 0.00000
title: Mulliken charges with hydrogens summed into heavy atoms:
elementType: O O O N C C C C C C C C C C
charge: -0.356190 -0.049043 0.040413 0.005282 0.224750 0.510792 0.100870 -0.181561 -0.041738 -0.348713 -0.065540 -0.052007 0.308356 -0.095670
polarizability: 2.47293153e+02 2.99866941e+00 1.32783542e+02 -2.57446731e-04 -2.79598236e-03 4.84404006e+01
1716.lowfreq: -5.0534 -0.0012 -0.0010 -0.0008 7.6174 8.4238 71.1574 119.6253 170.9829
frequency: 71.1567 119.6251 170.9822 192.3064 258.8964 303.2155 305.6352 364.7798 396.0258 408.1218 420.2191 425.3803 487.9471 512.4355 525.1671 525.5968 606.0534 627.4812 653.2041 690.7887 715.7607 787.9536 805.6321 819.6713 850.2401 876.2435 940.1599 970.4978 979.2917 991.4409 1043.8110 1058.0247 1099.0328 1125.7395 1147.8064 1189.0347 1225.6627 1257.5432 1265.8811 1296.4769 1347.9156 1392.3197 1412.2289 1436.2393 1463.8255 1489.6114 1566.8536 1598.3917 1613.8711 1631.8710 2064.4643 3114.6764 3139.1291 3158.9612 3170.3429 3183.1922 3576.1021
redmass: 9.3906 5.7732 6.5879 6.8418 4.2886 6.5676 5.5993 8.9626 7.9426 5.2295 1.2765 2.2844 6.8014 5.9193 9.7042 3.3056 5.9576 4.1702 7.0962 3.2757 7.0409 2.5822 1.5592 5.8008 1.6287 1.8403 3.4483 6.8871 1.3109 1.3478 8.8851 1.0931 1.8302 1.5113 1.2326 1.3809 2.7507 2.3071 2.1086 2.0226 3.8002 3.0614 5.4549 5.7368 3.5101 3.4190 6.1921 2.7068 3.9442 3.9266 1.0845 1.0918 1.0879 1.0893 1.0976 1.0971 1.0661
irintensity: 0.2122 0.0903 0.3172 1.6771 0.5804 1.1352 0.0359 4.7070 6.1207 17.6889 153.3991 14.3270 9.5816 2.1361 7.2079 9.6323 15.1943 1.5863 15.8862 12.9133 1.8896 1.3662 10.5817 5.4326 31.9743 69.9463 2.3345 36.9905 0.0089 0.3209 151.8390 145.3077 6.9874 178.0126 197.2260 0.8260 22.0381 20.3937 101.3501 5.5002 17.9214 118.7738 3.2723 370.0003 64.6803 6.5598 12.3250 10.1812 277.5900 81.2638 146.9434 12.7889 5.4925 0.2155 8.0784 3.6417 85.8544
temp: 298.150 k
press: 1.00000 atm
elementType: 8 8 8 7 6 6 6 6 6 6 6 6 6 6 1 1 1 1 1 1 1
symmnumber: 1
zpe: 388014.3 jmol-1
zpe.correction: 0.147787 hartree
zpe.thermalcorrener: 0.158421 hartree
zpe.thermalcorrenthalpy: 0.159365 hartree
zpe.thermalcorrgfe: 0.111606 hartree
zpe.sumelectzpe: -664.667696 hartree
zpe.sumelectthermal: -664.657061 hartree
zpe.sumelectthermalent: -664.656117 hartree
zpe.sumelectthermalfe: -664.703877 hartree
dipole: 5.7743 3.0180 0.0010
dipole: 6.5155
quadrupole: -90.3598 -71.6148 -83.0536
quadrupole: 6.3966 -0.0106 -0.0124
quadrupole: -8.6838 10.0612 -1.3775 6.3966 -0.0106 -0.0124
hfenergy: -664.8154825 hartree
pointgroup: C01 [X(C10H7N1O3)]
dipole: -2.1759065 -1.3550354 0.0148403 debye
dipolederiv: -0.6351299 -0.1979329 0.001593 -0.3313035 -0.9071712 -0.0032458 -0.0006453 -0.0051387 -0.3544348 -1.8212501 -0.2635242 0.0188574 -0.3409559 -0.1319325 0.0102844 0.0176598 0.0090191 -0.4149557 -0.6928701 0.0508327 0.0067297 -1.236587 -0.6922223 0.014463 -0.0103426 -0.0064039 -0.294353 1.0151628 0.056172 -0.0185414 1.0845548 0.3902707 -0.0097724 -0.0047801 0.0068842 -0.1752912 -0.8153874 -0.328281 0.0068701 0.0262202 -0.2333387 -0.0027889 0.012313 0.0029736 -0.0856661 0.7908436 -0.0248155 -0.0116493 -0.1105473 0.1579008 0.0025608 -0.0129727 0.0011247 0.1074835 1.2736723 0.3790995 -0.0117551 0.0809328 0.7085019 0.0062059 -0.0158684 0.0012759 0.2187385 -0.3765658 0.046571 0.0037372 0.0866417 0.110855 0.0036354 0.0039365 0.0042152 -0.1990291 0.3469817 0.1494085 -0.0045214 -0.13913 0.0661976 0.0046286 -0.0090515 -0.0001871 -0.0721885 -0.9686253 0.0385013 0.0127733 0.5310578 0.0205591 -0.0046559 0.020696 0.0034581 -0.2321006 -1.0485856 0.0608679 0.0197346 0.236048 -0.1360632 -0.0068526 0.0224757 -0.0040197 0.077988 0.2697543 0.003808 -0.0062498 0.2371103 0.1362889 -0.000038 -0.0023822 0.0039102 -0.1124408 1.8793281 0.2388591 -0.0248951 0.0106698 0.3478671 0.003335 -0.0285194 -0.0004102 0.1288573 -0.2857344 -0.1948659 -0.0015163 -0.3511951 -0.1761893 0.0059768 -0.0041324 0.0034083 -0.1856463 0.0454202 -0.090881 0.0004235 -0.0132339 -0.0704066 -0.0034875 0.0016925 -0.0021886 0.1590317 0.1036387 -0.0586954 -0.000157 -0.0003585 0.0144173 -0.0022483 0.0007665 -0.0012746 0.1519194 0.0198434 -0.0505635 0.0017534 -0.0827037 -0.0668169 -0.002579 0.0012536 -0.0031232 0.1765042 0.0386748 0.093163 0.003507 0.0292246 0.0192181 -0.002762 0.002484 -0.0038072 0.1624478 0.0204069 0.0681678 0.0036715 0.0710762 0.0335972 -0.0034716 0.003711 -0.0034471 0.1751305 0.3678277 -0.058407 -0.0003418 0.1080309 0.3274736 -0.0024027 0.0014283 0.0001549 0.3787912 0.472594 0.0825159 -0.0000236 0.1044476 0.0809932 -0.0067852 0.0002775 -0.0064239 0.3892138 unknown
polarizability: 246.1443206|11.5889373|133.8630108|-3.0803826|1.1651167|48.509764 unknown
InChI: InChI=1S/C10H7NO3/c12-7-2-3-8-6(5-7)1-4-9(11-14)10(8)13/h1-5,12,14H
charge 0 multiplicity 1
21 atoms
O  1.640732 1.992113 -0.009141
O  -4.414068 -0.264804 0.055511
O  3.92648 1.090832 -0.0615
N  3.467498 -0.216537 -0.072332
C  -0.264531 0.481785 -0.000662
C  -0.71547 -0.885797 -0.0153
C  1.160408 0.768334 -0.019795
C  0.253375 -1.975669 -0.048649
C  -1.215685 1.543585 0.032145
C  -2.110959 -1.145471 0.003524
C  2.107197 -0.365878 -0.053016
C  1.60703 -1.728172 -0.066815
C  -3.031315 -0.075597 0.03589
C  -2.587165 1.277726 0.050506
H  -0.120012 -3.005488 -0.059071
H  -0.841726 2.57211 0.042675
H  -2.465914 -2.184512 -0.007462
H  2.348429 -2.532811 -0.09171
H  -3.333434 2.075938 0.075823
H  3.056133 1.749997 -0.035653
H  -4.653502 -1.225282 0.04363
