program: Gaussian 09
title: 000292317
version: EM64L-G09RevD.01
frameworkgroup: C1[X(C20H25NO6S)]
method: RPBEPBE
basis: SDD
operation: Freq
keyword: #p
keyword: freq=noraman
keyword: PBEPBE/SDD
title: #p freq=noraman PBEPBE/SDD
converged: YES YES NO NO
title: Mulliken charges:
elementType: S O O O O O O N C C C C C C C C C C C C C C C C C C C C H H H H H H H H H H H H H H H H H H H H H H H H H
charge: 1.008546 -0.265959 -0.555833 -0.488216 -0.489256 -0.205265 -0.193622 0.022248 0.138212 0.299038 -0.414283 0.510534 -0.714977 -0.779245 -0.728082 -0.726911 -0.725481 -0.390200 -0.390953 -0.414442 -0.399547 0.333430 0.438245 -0.254763 -0.268695 -0.384781 -0.366730 0.421771 0.195907 0.192448 0.216986 0.225856 0.214666 0.216708 0.226807 0.212585 0.210839 0.214027 0.214242 0.208341 0.209550 0.231975 0.208728 0.219028 0.217745 0.238400 0.260498 0.266679 0.268314 0.288086 0.346883 0.293937 0.385983
chargesum: 0.00000
title: Mulliken charges with hydrogens summed into heavy atoms:
elementType: S O O O O O O N C C C C C C C C C C C C C C C C C C C C
charge: 1.008546 -0.265959 -0.169850 -0.488216 -0.489256 -0.205265 -0.193622 0.022248 0.138212 0.299038 -0.025928 0.510534 -0.057469 -0.123144 -0.088974 -0.077046 -0.079979 -0.151800 -0.130455 -0.147763 -0.131234 0.333430 0.438245 -0.254763 0.019391 -0.037898 -0.072793 0.421771
polarizability: 3.85568396e+02 -2.81940910e+01 2.86001396e+02 8.13880581e-01 1.04616723e+01 1.95643801e+02
1716.lowfreq: -4.5764 -0.0001 0.0009 0.0016 1.1106 7.1697 12.5207 16.8559 25.4779
frequency: 11.2977 16.3143 25.1554 34.9575 50.2428 54.9801 58.8967 67.4632 86.2341 96.2575 114.2459 120.3312 126.5729 158.2657 179.5476 183.2621 202.2450 214.5524 219.8549 225.5984 235.4745 244.4015 250.0088 272.8325 274.4302 282.2028 289.6985 303.0732 308.4965 321.0340 338.1446 349.2092 357.8997 361.7446 369.0116 398.0834 403.0076 409.9144 416.5483 438.4579 448.8890 461.5021 475.4375 496.4654 520.7353 524.2491 556.0768 565.2028 574.8191 623.4417 635.6537 651.5920 684.8583 691.6924 730.2777 736.8185 741.2536 752.5504 807.1787 825.5423 832.6561 839.4683 845.6389 851.8983 867.4297 869.3840 908.2424 921.5378 927.1590 936.6557 941.4189 955.0473 957.6808 959.2759 972.0879 977.1193 996.6794 1003.6396 1008.3555 1009.8810 1024.9547 1033.1138 1071.3546 1090.6409 1098.5499 1110.5590 1131.5387 1135.1422 1151.2895 1161.3008 1194.2225 1197.3145 1210.6402 1219.8406 1237.8674 1251.1681 1252.4918 1255.4587 1302.6161 1327.1141 1342.4789 1354.8591 1364.3737 1370.9934 1377.5219 1379.3862 1394.5312 1397.8416 1403.8010 1406.0733 1428.5279 1453.6764 1455.8817 1460.1025 1463.9816 1465.7465 1466.1763 1474.1969 1479.6302 1483.2445 1489.5869 1492.2523 1497.6239 1503.7579 1573.6786 1589.7703 1600.6336 1614.3923 2961.0950 2964.5295 2971.6128 2973.4841 2976.9777 2980.6260 3013.0920 3058.1729 3061.0497 3062.5682 3068.0523 3069.7141 3071.6965 3078.1918 3078.7291 3084.7644 3095.2082 3141.9053 3146.2504 3161.6754 3167.2226 3168.9241 3171.7177 3187.4980 3483.4082
redmass: 5.8913 5.9787 4.8498 3.9563 5.2466 8.8194 3.5045 3.3994 3.8675 6.8321 6.6916 2.1564 4.6049 7.7702 2.6352 3.8687 3.0862 4.2460 1.3411 2.4124 1.1020 9.4160 1.6032 2.0825 6.0701 1.4275 1.7463 2.6781 4.7266 3.9194 7.3303 1.4323 2.6874 2.1198 3.4511 2.9754 5.0115 2.3283 2.3355 6.1896 3.8817 3.7455 2.7938 2.8885 5.3209 5.0606 6.1257 4.0363 3.7502 6.5983 7.2272 5.0639 6.4267 6.5243 4.0255 4.2144 4.0916 5.6516 6.9598 2.6204 1.3515 7.3229 1.6038 1.5428 2.6488 3.6321 2.0921 1.6725 1.5636 1.4638 1.2708 6.0059 1.3981 1.3753 1.4465 1.6469 1.3507 1.9070 1.8409 2.9109 1.4091 1.4083 1.2627 2.0569 3.0326 1.6482 1.9608 1.2864 2.3185 1.7780 1.9910 1.7138 4.5577 2.9731 2.1482 3.1588 2.8693 2.9172 1.2804 1.5230 1.3421 5.8670 5.1157 1.2119 1.2337 1.2052 8.6256 1.2916 1.4285 2.0967 6.5671 2.5064 1.1093 1.0574 1.0572 1.0629 1.0686 1.0617 1.0546 1.0601 1.0933 2.0737 1.0689 1.0555 8.3911 7.3763 6.8151 7.0402 1.0560 1.0364 1.0360 1.0347 1.0378 1.0371 1.1000 1.0996 1.0993 1.0994 1.0992 1.0985 1.1001 1.0999 1.0984 1.0992 1.0962 1.0881 1.0889 1.0924 1.0950 1.0893 1.0964 1.0965 1.0662
irintensity: 0.6254 0.8049 0.3464 13.8519 0.5039 0.0418 0.0689 0.1388 24.1795 4.7281 3.4339 77.1344 0.5420 1.1060 1.3559 3.2249 10.3788 2.0861 0.9553 0.5256 0.1797 6.1803 0.3706 2.8756 7.2407 0.6923 0.8712 0.2254 12.6764 2.2335 5.5648 0.2851 1.5555 0.3587 1.4245 1.7726 40.7996 0.1217 0.0671 55.6781 8.7856 2.1012 0.3749 1.6170 17.9291 30.4369 87.0163 13.9235 7.7688 6.0150 6.1372 10.5648 3.6054 6.1371 5.4819 13.1162 4.7338 8.6548 2.6154 10.2305 8.7751 74.1489 46.9472 30.9527 17.6200 45.4011 1.8291 6.2087 2.5797 2.0631 0.2323 75.0779 20.4881 5.0004 1.7393 8.2185 0.9093 18.4762 27.9996 16.8581 0.8780 0.7011 66.7181 23.0892 23.8016 6.7830 6.1207 30.4695 116.8312 9.3934 57.0123 80.3177 329.8470 11.2381 295.8689 17.7411 14.0061 187.3889 0.4842 10.1982 5.0784 37.0871 4.3110 9.2041 28.6215 17.0961 91.4640 9.1049 10.3066 20.9417 2.9571 189.4439 4.9401 1.9518 0.5932 1.2423 0.1306 8.8462 23.8489 11.7088 30.8116 113.3407 21.4244 16.6841 22.3393 5.2527 136.0292 78.5336 21.2091 47.1161 44.8978 37.6198 16.7902 24.5362 30.5683 2.0051 42.1964 26.6500 20.1534 103.8052 45.4948 38.9874 37.9687 48.2319 36.0997 16.2479 7.4749 27.9743 5.8487 0.7802 0.0162 2.4117 52.8425
temp: 298.150 k
press: 1.00000 atm
elementType: 16 8 8 8 8 8 8 7 6 6 6 6 6 6 6 6 6 6 6 6 6 6 6 6 6 6 6 6 1 1 1 1 1 1 1 1 1 1 1 1 1 1 1 1 1 1 1 1 1 1 1 1 1
symmnumber: 1
zpe: 1084986.1 jmol-1
zpe.correction: 0.413249 hartree
zpe.thermalcorrener: 0.442939 hartree
zpe.thermalcorrenthalpy: 0.443884 hartree
zpe.thermalcorrgfe: 0.350769 hartree
zpe.sumelectzpe: -1678.901074 hartree
zpe.sumelectthermal: -1678.871384 hartree
zpe.sumelectthermalent: -1678.870440 hartree
zpe.sumelectthermalfe: -1678.963555 hartree
dipole: 10.2428 -0.8253 1.1052
dipole: 10.3352
quadrupole: -210.1627 -189.5086 -173.3738
quadrupole: 6.3275 -2.2058 -6.7529
quadrupole: -19.1477 1.5065 17.6412 6.3275 -2.2058 -6.7529
hfenergy: -1679.3143238 hartree
pointgroup: C01 [X(C20H25N1O6S1)]
dipole: -4.0004859 -0.0380114 0.7270218 debye
polarizability: 388.6267522|-19.6827403|282.3108506|-14.4623769|-7.0263996|196.2759907 unknown
InChI: InChI=1S/C20H25NO6S/c1-19(2,3)13-20(4,5)14-6-9-16(10-7-14)27-17-11-8-15(21(22)23)12-18(17)28(24,25)26/h6-12,24H,13H2,1-5H3
charge 0 multiplicity 1
53 atoms
S  3.991157 2.529697 -0.59517
O  1.184381 1.398044 -0.301392
O  3.451918 3.066981 1.094213
O  5.60333 2.551267 -0.671829
O  3.129355 3.342166 -1.693909
O  4.86053 -3.828632 -0.135146
O  6.441114 -2.196957 -0.378572
N  5.218948 -2.592823 -0.25861
C  -4.491011 0.662703 0.753095
C  -4.978237 -1.876643 -0.235449
C  -5.174433 -0.31739 -0.273982
C  -2.969839 0.801538 0.49446
C  -5.129305 2.071909 0.50823
C  -4.800596 0.275266 2.221339
C  -5.438431 -2.406793 -1.626142
C  -5.879389 -2.548669 0.839327
C  -3.503457 -2.305779 -0.017131
C  -2.497207 1.165832 -0.797569
C  -2.002608 0.637554 1.520479
C  -1.124076 1.33361 -1.068955
C  -0.621183 0.802997 1.274935
C  -0.201982 1.134904 -0.025772
C  2.111757 0.375481 -0.264883
C  3.479622 0.730269 -0.395043
C  1.787086 -1.002359 -0.136097
C  4.512175 -0.209422 -0.392424
C  2.804445 -1.968636 -0.139028
C  4.153869 -1.567421 -0.263444
H  -6.267078 -0.129587 -0.208163
H  -4.879782 0.021781 -1.288027
H  -5.02145 2.393138 -0.543528
H  -4.650264 2.835791 1.1475
H  -6.20898 2.046826 0.746184
H  -4.480888 1.074224 2.916479
H  -5.888918 0.139539 2.350759
H  -4.30701 -0.662738 2.529176
H  -4.781934 -2.03061 -2.433546
H  -6.47368 -2.086667 -1.851559
H  -5.412383 -3.512308 -1.652639
H  -6.9421 -2.278876 0.686975
H  -5.79867 -3.65006 0.767549
H  -5.600257 -2.261842 1.866291
H  -3.415743 -3.405457 -0.108236
H  -2.835017 -1.846116 -0.768232
H  -3.130965 -2.021875 0.983208
H  -3.208347 1.32719 -1.614422
H  -2.317968 0.379668 2.534957
H  -0.766476 1.623596 -2.0613
H  0.111964 0.691574 2.080637
H  0.739324 -1.299193 -0.041266
H  5.560444 0.093907 -0.484327
H  2.575131 -3.033634 -0.04845
H  3.187211 4.029639 1.017652
