program: Gaussian 09
title: 000292209
version: EM64L-G09RevD.01
frameworkgroup: C1[X(C12H14N2O3)]
method: RPBEPBE
basis: SDD
operation: Freq
keyword: #p
keyword: freq=noraman
keyword: PBEPBE/SDD
title: #p freq=noraman PBEPBE/SDD
converged: YES YES NO NO
title: Mulliken charges:
elementType: O O O N N C C C C C C C C C C C C H H H H H H H H H H H H H H
charge: -0.422307 -0.234258 -0.432631 -0.359911 -0.017068 -0.109323 -0.667535 0.496405 -0.346224 0.225352 -0.388037 -0.375115 -0.437512 -0.388422 -0.355740 0.282527 -0.148018 0.256620 0.255960 0.207727 0.274988 0.261256 0.216157 0.229218 0.266882 0.236684 0.270596 0.218489 0.252353 0.377621 0.353266
chargesum: 0.00000
title: Mulliken charges with hydrogens summed into heavy atoms:
elementType: O O O N N C C C C C C C C C C C C
charge: -0.044686 -0.234258 -0.079365 -0.084922 -0.017068 0.147297 -0.203849 0.496405 0.131189 0.225352 -0.158819 -0.108233 0.069768 -0.169933 -0.103387 0.282527 -0.148018
polarizability: 2.03808776e+02 -9.86323509e+00 1.34362839e+02 -7.54561252e+00 -1.02827851e+01 1.09134827e+02
1716.lowfreq: -16.6991 -7.2317 0.0002 0.0003 0.0006 3.4240 17.1935 24.1676 30.3446
frequency: 8.0193 23.4208 30.2390 42.4262 51.7461 75.8961 91.3925 118.7173 146.7337 180.0939 191.9330 248.5649 292.1967 310.4991 331.6633 358.9243 375.0452 390.5800 403.4419 412.3576 451.6946 481.0734 496.9047 542.4953 560.4507 595.1181 624.6362 637.1779 708.0894 719.3440 761.5695 779.6770 787.3758 806.6928 829.4085 844.9645 927.5400 933.9026 964.6561 971.8502 1005.1804 1008.3687 1018.7467 1039.3590 1064.4468 1096.4432 1113.2696 1144.3374 1145.7149 1180.1884 1181.9864 1197.6014 1217.0612 1247.7515 1249.6624 1261.4215 1286.5437 1299.3854 1320.0182 1329.7645 1359.7112 1376.3669 1393.2624 1427.9315 1446.4941 1457.6800 1466.9950 1492.3144 1505.8062 1597.1287 1627.6559 1669.3927 2199.9127 2904.5532 2960.4234 2985.1978 2994.7864 3051.7607 3055.5153 3070.3747 3108.0538 3131.8821 3146.0627 3172.7669 3487.2333 3502.1219 3581.3903
redmass: 2.9386 5.5708 4.0419 4.3918 6.3406 9.3837 4.7551 3.5673 6.1773 6.8497 5.5002 3.6170 5.3713 2.6290 4.7344 1.1192 3.4116 5.1799 3.0826 2.9602 2.6791 3.3115 3.3817 2.9303 3.3490 3.0015 1.3506 6.6257 4.0257 3.6309 4.2280 1.3273 2.4873 1.5378 3.8494 1.6612 1.6708 2.8375 1.8909 1.4360 2.8702 2.6988 3.3035 3.2657 2.2488 1.6810 1.7222 1.3715 3.3457 1.2174 1.1518 1.3019 2.2281 1.8730 2.2919 1.2302 1.1168 1.3584 1.3691 1.3307 1.6074 1.3314 5.4884 2.7905 1.0886 1.2617 1.1169 1.0774 2.7496 6.3717 6.4137 8.4663 12.4355 1.0713 1.0840 1.0618 1.0610 1.0923 1.0998 1.0970 1.0870 1.0968 1.0895 1.0962 1.0755 1.0639 1.0660
irintensity: 0.4123 2.6519 2.7299 1.5225 0.8460 2.6210 5.9180 2.2378 0.6336 1.7932 2.6179 17.8341 9.2350 1.9153 0.8377 143.5123 2.4453 3.3825 14.5745 2.8168 47.0378 39.1278 30.7501 42.5473 28.0016 6.7330 121.4800 3.5266 53.8388 0.6224 16.7424 4.2059 16.6069 14.2302 9.6257 35.8554 1.2745 3.2878 9.1321 0.8245 3.3944 54.9506 45.7845 95.5991 65.1679 28.8795 44.1373 214.3594 101.7251 5.9631 4.1867 4.4033 1.5290 21.1195 14.7850 12.7827 6.4120 13.4785 13.9123 1.8953 36.3162 10.8438 10.6958 11.3862 12.8603 21.5506 10.0698 7.1248 97.2763 6.9914 38.2485 195.4505 14.6715 74.1540 32.6697 35.1820 10.1586 0.6058 9.8979 12.1340 18.9781 18.7556 3.2107 4.6487 1.6440 19.0593 39.8922
temp: 298.150 k
press: 1.00000 atm
elementType: 8 8 8 7 7 6 6 6 6 6 6 6 6 6 6 6 6 1 1 1 1 1 1 1 1 1 1 1 1 1 1
symmnumber: 1
zpe: 634550.4 jmol-1
zpe.correction: 0.241687 hartree
zpe.thermalcorrener: 0.259157 hartree
zpe.thermalcorrenthalpy: 0.260101 hartree
zpe.thermalcorrgfe: 0.192069 hartree
zpe.sumelectzpe: -799.567529 hartree
zpe.sumelectthermal: -799.550060 hartree
zpe.sumelectthermalent: -799.549116 hartree
zpe.sumelectthermalfe: -799.617147 hartree
dipole: -2.6913 -2.0942 -1.0507
dipole: 3.5683
quadrupole: -133.5987 -93.6847 -98.7885
quadrupole: 17.3288 -18.0088 5.1070
quadrupole: -24.9081 15.0060 9.9021 17.3288 -18.0088 5.1070
hfenergy: -799.8092166 hartree
pointgroup: C01 [X(C12H14N2O3)]
dipole: -1.0827377 0.8922646 0.0492573 debye
polarizability: 203.1615518|14.0874346|123.0778541|2.357275|-16.335303|121.0670369 unknown
InChI: InChI=1S/C12H14N2O3/c13-6-1-7-14-11(12(16)17)8-9-2-4-10(15)5-3-9/h2-5,11,14-16H,1,7-8H2
charge 0 multiplicity 1
31 atoms
O  1.204272 -2.027824 -0.748212
O  0.226366 -2.029751 1.358792
O  -5.725709 -0.129187 -0.953738
N  2.051605 0.551146 0.64292
N  6.503651 0.721392 -1.42783
C  0.698436 0.137038 0.202362
C  -0.399515 0.82259 1.055637
C  -1.808307 0.588062 0.527156
C  3.111984 0.613615 -0.372568
C  0.640967 -1.391587 0.36921
C  -2.346167 1.426376 -0.481561
C  -2.612293 -0.477311 1.013344
C  4.500328 0.590627 0.325528
C  -3.643499 1.215541 -0.996992
C  -3.909321 -0.701566 0.511213
C  -4.424275 0.145863 -0.49632
C  5.613542 0.664275 -0.635018
H  0.52945 0.375584 -0.869086
H  -0.30751 0.453388 2.093671
H  -0.178202 1.908428 1.05969
H  2.038516 1.338374 1.299952
H  3.020807 -0.27408 -1.021466
H  3.045553 1.511328 -1.031165
H  -1.750162 2.263613 -0.866393
H  -2.209738 -1.140862 1.786393
H  4.586674 1.440884 1.030621
H  4.583571 -0.335205 0.923604
H  -4.043325 1.879632 -1.774654
H  -4.532394 -1.519528 0.884513
H  1.215424 -3.012905 -0.599368
H  -5.996525 0.513248 -1.655633
