program: Gaussian 09
title: 000292203
version: EM64L-G09RevD.01
frameworkgroup: C1[X(C11H9NO4)]
method: RPBEPBE
basis: SDD
operation: Freq
keyword: #p
keyword: freq=noraman
keyword: PBEPBE/SDD
title: #p freq=noraman PBEPBE/SDD
converged: YES YES NO NO
title: Mulliken charges:
elementType: O O O O N C C C C C C C C C C C H H H H H H H H H
charge: -0.282720 -0.160834 -0.205995 -0.193633 0.021837 -0.441534 -0.508828 0.269843 -0.312023 0.358648 0.177323 -0.462585 -0.385323 0.379070 -0.197603 -0.371099 0.235318 0.243523 0.258963 0.254452 0.228902 0.333122 0.230141 0.240362 0.290673
chargesum: 0.00000
title: Mulliken charges with hydrogens summed into heavy atoms:
elementType: O O O O N C C C C C C C C C C C
charge: -0.282720 -0.160834 -0.205995 -0.193633 0.021837 0.037307 0.004587 0.269843 -0.083121 0.358648 0.177323 -0.129462 -0.155182 0.379070 0.042759 -0.080427
polarizability: 2.16714991e+02 -4.00912407e+00 1.60284637e+02 3.85360852e+00 1.78886730e+00 6.42052684e+01
1716.lowfreq: -6.2704 -0.0007 0.0003 0.0006 3.6036 6.2598 17.9151 48.6745 80.9282
frequency: 17.7583 48.6698 80.9249 86.5833 121.0626 159.4928 180.3513 218.2801 248.0884 288.5541 344.2997 399.3680 423.9627 446.9922 461.2096 487.2121 516.2093 540.2319 603.9605 621.1345 645.6238 683.5056 690.0668 710.3557 741.1748 776.1762 801.6526 819.3872 851.2718 916.6578 927.8022 939.0107 970.0183 987.3552 999.4109 1014.4184 1017.8895 1047.2267 1089.3417 1090.7132 1124.7210 1164.7813 1182.1942 1214.0798 1223.4455 1263.2338 1282.1226 1300.9576 1309.0382 1343.9565 1375.9416 1390.2320 1435.1344 1444.5427 1460.4150 1480.2732 1581.3229 1617.9760 1659.3022 1701.2481 2968.8638 2996.0717 3050.4717 3099.5955 3145.4634 3164.8039 3172.1703 3189.7688 3196.3444
redmass: 5.5194 11.7327 8.3809 5.3354 4.7262 4.4921 3.3318 7.5773 2.7678 5.6784 6.9023 8.3550 3.2524 3.6217 5.1090 4.7876 5.3649 5.3059 5.6468 5.5844 6.3791 2.2507 4.3798 5.5842 2.3778 5.2728 1.5849 1.5847 3.8792 4.8299 2.4586 1.4546 1.4540 6.1199 1.3630 3.5883 2.4743 2.0741 1.9322 1.6694 2.6090 1.2742 1.1787 6.4672 1.4486 2.2319 1.3859 1.6608 1.5174 1.5573 10.1568 6.3583 3.4445 1.0839 1.0966 2.6697 6.4304 6.9540 7.8112 11.9685 1.0682 1.0653 1.0936 1.0959 1.0875 1.0946 1.0917 1.0962 1.0924
irintensity: 0.9656 0.0228 0.3850 2.3278 1.2477 2.9105 1.2994 2.6732 0.5341 0.6314 0.2827 0.6986 0.7520 1.1474 3.6792 0.5069 1.2538 11.9696 4.1699 3.8991 4.4577 14.9119 29.1135 22.2671 23.0736 34.3865 34.1807 25.7987 58.8928 15.8293 23.3479 0.3663 20.2796 4.2554 0.8813 124.9802 5.0019 178.2944 48.5172 17.3949 82.4224 41.0226 15.4627 206.6456 45.3790 61.4799 10.2017 16.2439 6.6327 22.9448 102.8241 18.3456 19.8164 21.9217 10.2439 31.6861 0.9139 3.2382 10.5300 298.1769 25.7354 10.8892 21.6437 11.5762 7.5202 7.4241 12.9625 3.7829 11.7487
temp: 298.150 k
press: 1.00000 atm
elementType: 8 8 8 8 7 6 6 6 6 6 6 6 6 6 6 6 1 1 1 1 1 1 1 1 1
symmnumber: 1
zpe: 475825.9 jmol-1
zpe.correction: 0.181233 hartree
zpe.thermalcorrener: 0.194636 hartree
zpe.thermalcorrenthalpy: 0.195581 hartree
zpe.thermalcorrgfe: 0.139210 hartree
zpe.sumelectzpe: -778.985781 hartree
zpe.sumelectthermal: -778.972378 hartree
zpe.sumelectthermalent: -778.971433 hartree
zpe.sumelectthermalfe: -779.027804 hartree
dipole: -4.6545 7.9785 0.6319
dipole: 9.2585
quadrupole: -92.9638 -97.5148 -91.5110
quadrupole: 0.5157 -0.9270 -0.6319
quadrupole: 1.0328 -3.5183 2.4855 0.5157 -0.9270 -0.6319
hfenergy: -779.167014 hartree
pointgroup: C01 [X(C11H9N1O4)]
dipole: -1.769045 3.1811254 0.1387035 debye
dipolederiv: -1.3261953 -0.9102444 0.0845966 -0.4986617 -1.0039025 0.0415103 0.1065382 0.0042854 -0.2044919 -0.5909184 -0.1836649 0.0329278 -0.4611738 -1.1208038 -0.0244688 -0.0028653 -0.0848297 -0.3094279 -0.9397919 0.0411738 -0.0573424 0.133727 -0.486719 -0.0031225 -0.0544609 -0.0102036 -0.2336 -0.5214547 0.0011144 -0.0253817 0.0302636 -0.8106528 -0.0305435 -0.0248112 -0.0306723 -0.2198681 1.4187572 -0.2692821 0.0900713 -0.4481179 1.3769046 0.0267447 0.0841889 0.0381245 0.1944689 0.0011453 -0.0439716 0.0039396 -0.0350832 0.0550764 0.0267365 -0.104474 0.0554966 0.160788 -0.1759159 0.0880178 0.073352 0.1562976 -0.1457632 -0.0360554 0.0670825 -0.0605564 0.0843505 0.3946478 0.1651054 0.0194229 0.5484013 0.8749126 -0.0560854 -0.0375105 0.035941 0.0628215 -0.0381875 0.0877277 0.0434393 -0.0242664 -0.1851302 0.0137316 0.1296396 -0.0301545 -0.2571974 0.4093203 -0.0167427 0.0512313 -0.0613643 -0.2620551 0.0061741 0.0709541 -0.0043665 0.023236 1.604458 0.8305012 -0.1911829 0.6363776 1.4920405 0.1022841 -0.1797382 0.1050115 0.2587027 -0.0937389 -0.1835075 -0.010481 0.0966398 -0.0363453 0.0129713 0.0071639 -0.0115954 -0.0910723 -0.0563264 -0.0625288 -0.0049481 -0.0587745 0.0775551 0.0111233 -0.0038762 0.0078504 -0.1123641 -0.1486128 0.2456608 -0.0041805 0.2790567 -0.2831601 0.0044789 -0.0094258 0.0042532 0.0584066 -0.1839193 0.1341798 0.0057906 0.1779602 0.1327329 0.0318819 0.0088644 0.0253991 -0.1287913 -0.1340031 0.0539254 0.0008835 -0.2391568 0.0437017 -0.010258 -0.0146465 0.0133231 -0.1139853 -0.0420456 0.0835231 0.028709 0.0781721 -0.0550362 -0.0372717 0.0975838 -0.0580106 0.0850499 -0.0337343 0.0117027 -0.0544837 -0.1003567 0.0989087 -0.0344594 -0.0763099 0.0064751 -0.1015875 -0.0742949 -0.0580597 -0.0108894 -0.1021013 0.0534089 -0.0026851 -0.0299282 0.0049269 0.112257 0.1279377 0.0148105 -0.0533784 0.0404886 0.0603406 -0.0288132 -0.0025141 0.0107622 -0.0689085 0.0707236 -0.0724824 0.0055305 -0.1252119 -0.0484392 0.0169103 -0.0006712 -0.0005714 0.1651395 0.2061835 0.0078444 -0.0032406 -0.0514821 0.0991891 -0.0062947 -0.0059941 -0.0022392 0.1691732 0.0313727 0.117345 -0.0009677 0.0899401 0.0072997 -0.0041968 0.0005857 0.0039795 0.1401831 0.0479386 -0.0531551 -0.010916 -0.0614586 -0.0724764 -0.0182792 -0.0121573 -0.0188611 0.1531008 0.0466546 -0.0289927 -0.0125018 -0.0001153 0.138413 -0.0020133 -0.0132175 -0.0037679 0.1736166 unknown
polarizability: 215.8439438|-5.2519277|160.5143538|10.7888106|0.5503702|64.8465984 unknown
InChI: InChI=1S/C11H9NO4/c13-11-6-2-5-10(16-11)8-3-1-4-9(7-8)12(14)15/h1,3-5,7H,2,6H2
charge 0 multiplicity 1
25 atoms
O  -1.68052 -0.807063 -0.202398
O  -3.239788 -2.479069 -0.15778
O  4.544899 -1.0066 0.229188
O  2.766018 -2.414479 0.003806
N  3.279863 -1.236958 0.107621
C  -3.793243 1.119699 -0.508451
C  -4.047713 -0.185559 0.282574
C  -1.364118 0.590559 -0.20887
C  -2.340626 1.523498 -0.388874
C  0.093488 0.81312 -0.066386
C  -3.027151 -1.264396 -0.048655
C  0.977449 -0.29599 -0.045956
C  0.636357 2.124009 0.054049
C  2.360106 -0.065506 0.087034
C  2.025409 2.324886 0.182531
C  2.911793 1.227125 0.20075
H  -4.450916 1.91975 -0.124506
H  -4.064604 0.978429 -1.575598
H  -5.050751 -0.600382 0.096391
H  -3.964754 0.022419 1.36813
H  -2.072337 2.580111 -0.464852
H  0.595342 -1.31518 -0.133257
H  -0.027158 2.994731 0.058152
H  2.41981 3.341702 0.274792
H  3.992843 1.349846 0.301964
