program: Gaussian 09
title: 000292262
version: EM64L-G09RevD.01
frameworkgroup: C1[X(C21H20O2S)]
method: RPBEPBE
basis: SDD
operation: Freq
keyword: #p
keyword: freq=noraman
keyword: PBEPBE/SDD
title: #p freq=noraman PBEPBE/SDD
converged: YES YES NO NO
title: Mulliken charges:
elementType: S O O C C C C C C C C C C C C C C C C C C C C C H H H H H H H H H H H H H H H H H H H H
charge: 0.178314 -0.266659 -0.264675 -0.838462 0.509661 0.533448 -0.379828 -0.393596 -0.365272 -0.366797 -0.135996 -0.356336 -0.357321 -0.365044 -0.358412 0.312182 0.319646 -0.280104 -0.155253 -0.212498 -0.259596 -0.242940 -0.538212 -0.538338 0.287976 0.241253 0.241146 0.263566 0.250174 0.250172 0.250276 0.240348 0.239149 0.242343 0.257486 0.226655 0.226548 0.228189 0.220583 0.222454 0.245488 0.221161 0.245139 0.221983
chargesum: 0.00000
title: Mulliken charges with hydrogens summed into heavy atoms:
elementType: S O O C C C C C C C C C C C C C C C C C C C C C
charge: 0.178314 -0.266659 -0.264675 -0.550487 0.509661 0.533448 -0.138575 -0.152450 -0.101706 -0.116624 -0.135996 -0.106163 -0.107045 -0.124696 -0.119263 0.312182 0.319646 -0.037761 0.102233 0.014157 -0.033048 -0.014751 0.150312 0.149945
polarizability: 3.37869025e+02 -1.17380159e+01 2.76807117e+02 7.81759983e+00 -5.69622936e-01 1.80078918e+02
1716.lowfreq: -7.8116 -0.0011 0.0003 0.0013 2.3997 6.0826 15.1629 18.2357 28.1647
frequency: 14.9423 17.8620 28.0411 30.8204 36.7415 44.0807 88.1911 95.1614 115.1723 126.4272 153.1831 163.9621 186.6629 194.5808 214.0469 230.5499 235.9027 255.4934 296.3859 330.8489 342.3429 374.1061 400.3226 410.0070 414.1359 415.1987 443.1071 462.5355 471.0853 505.2003 522.3110 534.7587 567.9691 612.1019 622.3934 629.3496 672.6392 692.4834 698.0301 706.9098 736.7791 742.7225 755.6870 759.4262 806.8351 817.6341 823.5262 834.1481 838.1500 848.1813 856.4980 901.4175 950.6085 955.4365 964.8244 967.0401 969.3861 983.7718 987.6936 988.0679 988.6656 1002.4859 1003.0694 1018.7286 1072.3438 1080.6102 1109.5436 1111.9683 1113.0586 1113.5921 1156.2649 1157.0228 1171.8499 1173.1162 1174.2774 1185.1010 1187.2615 1192.0775 1209.5446 1227.8752 1231.9609 1269.3772 1301.8362 1310.4318 1313.0623 1370.5638 1374.0286 1389.6702 1414.7174 1420.8670 1427.8097 1436.3475 1437.2294 1463.6690 1466.5616 1467.0475 1472.6610 1473.0987 1498.1896 1499.3062 1579.3310 1582.1820 1583.4470 1592.4660 1620.9099 1622.2105 2959.3497 2959.7246 3010.8020 3046.9189 3047.5396 3123.6639 3123.6980 3124.5519 3125.0528 3128.1030 3130.9134 3134.8473 3140.9492 3144.1737 3155.7931 3161.1570 3162.9921 3166.6654 3166.9288 3168.2695
redmass: 5.2119 3.6001 3.6104 4.8266 4.2492 5.1237 4.0078 3.5955 5.0210 5.8800 4.0306 4.0476 4.8183 3.8685 5.7531 1.2852 1.2313 2.8483 3.9327 5.7018 5.5711 7.3795 3.0236 4.0068 3.3632 4.0555 4.8429 4.2507 3.3052 3.3911 3.2260 3.7630 3.9089 6.4297 6.6025 6.9821 6.8308 2.3496 3.9833 3.9935 4.3596 1.5844 4.4422 3.9173 3.2922 1.2850 1.2661 1.9926 1.2668 2.1027 3.3637 1.3775 1.3741 1.3667 1.3606 1.3929 1.3566 4.5273 1.4170 8.0514 8.5229 2.7113 2.6339 3.3709 2.4780 1.6145 1.3508 1.3571 1.2619 1.2618 1.3575 1.3422 1.0509 1.6575 1.3197 1.2578 1.5404 1.1955 1.5750 3.2276 3.1838 1.9977 1.2806 1.3500 1.3446 5.1915 7.0971 3.9197 3.9112 3.5579 2.2147 1.1718 1.1702 2.0162 1.0503 1.0499 1.0815 1.0776 2.4241 2.4096 7.0622 6.0948 6.9620 5.9297 6.3255 6.4698 1.0330 1.0330 1.0846 1.1039 1.1039 1.0890 1.0849 1.0993 1.0992 1.0896 1.0880 1.0885 1.0877 1.0933 1.0952 1.0941 1.0950 1.0991 1.0972 1.0956
irintensity: 0.3576 0.8669 0.6845 0.3608 0.4779 0.1582 1.9541 4.1005 1.6215 2.9190 1.6252 4.1910 0.5803 4.7903 0.2648 0.2190 0.4253 1.5142 2.5108 0.6848 1.4128 1.8272 0.0429 1.1426 1.2316 0.9732 0.0879 1.7152 10.3894 4.1873 8.5428 42.1234 46.9924 1.1877 2.5308 1.6038 28.7384 27.9879 21.3422 2.9489 13.5987 74.4041 11.5273 9.9516 63.7701 3.9055 0.6414 44.7601 2.9906 21.0867 10.5671 1.7443 0.5159 0.1590 0.5080 0.1224 0.9198 2.3005 1.5144 44.6272 42.0109 8.9526 13.8319 34.4916 31.5703 5.4522 11.8268 10.1107 0.3107 0.3786 0.1939 1.7683 0.1384 49.2160 136.6714 30.3622 7.7744 4.4962 10.0868 165.6098 198.3184 27.0066 2.5460 3.1782 0.9994 14.8049 3.2780 15.6930 3.6265 5.3973 6.5115 11.1092 13.2512 66.6483 12.2481 13.3612 79.2402 47.6416 117.0986 104.4985 23.9531 7.3479 32.4170 60.3688 87.5388 39.9682 59.5312 82.6542 7.8438 45.8270 47.2765 10.2754 4.1893 31.0462 26.4059 10.5686 3.8118 2.0807 6.7804 20.4257 22.2923 12.3886 15.6126 20.8839 12.4418 5.7958
temp: 298.150 k
press: 1.00000 atm
elementType: 16 8 8 6 6 6 6 6 6 6 6 6 6 6 6 6 6 6 6 6 6 6 6 6 1 1 1 1 1 1 1 1 1 1 1 1 1 1 1 1 1 1 1 1
symmnumber: 1
zpe: 915701.9 jmol-1
zpe.correction: 0.348772 hartree
zpe.thermalcorrener: 0.371326 hartree
zpe.thermalcorrenthalpy: 0.372270 hartree
zpe.thermalcorrgfe: 0.293060 hartree
zpe.sumelectzpe: -1359.004600 hartree
zpe.sumelectthermal: -1358.982047 hartree
zpe.sumelectthermalent: -1358.981103 hartree
zpe.sumelectthermalfe: -1359.060313 hartree
dipole: -0.2032 2.6263 -1.2741
dipole: 2.9261
quadrupole: -128.5423 -138.1130 -143.1393
quadrupole: -4.4046 3.9311 -9.8049
quadrupole: 8.0559 -1.5148 -6.5411 -4.4046 3.9311 -9.8049
hfenergy: -1359.3533727 hartree
pointgroup: C01 [X(C21H20O2S1)]
dipole: 0.0397206 0.9695079 0.6195101 debye
polarizability: 336.858782|13.7225256|276.4685549|7.263452|12.1996916|181.4277227 unknown
InChI: InChI=1S/C21H20O2S/c1-22-18-12-8-16(9-13-18)21(24-20-6-4-3-5-7-20)17-10-14-19(23-2)15-11-17/h3-15,21H,1-2H3
charge 0 multiplicity 1
44 atoms
S  -0.392393 -1.896466 0.833854
O  -2.199545 4.721734 0.337945
O  5.930846 -0.566791 -0.250434
C  0.164747 -0.496278 -0.37479
C  -0.504101 0.851702 -0.112253
C  1.687732 -0.465767 -0.313999
C  -0.539799 1.800154 -1.172744
C  2.442106 -1.377885 -1.102612
C  -1.056813 1.223338 1.132552
C  2.387098 0.434919 0.521884
C  -2.043509 -2.386087 0.183889
C  -1.106727 3.073278 -0.994338
C  3.845222 -1.386865 -1.062197
C  -1.63051 2.500842 1.332707
C  3.799428 0.437315 0.580102
C  -1.654669 3.430004 0.264723
C  4.530901 -0.47724 -0.216216
C  -2.526097 -3.655999 0.593927
C  -2.831465 -1.576342 -0.669882
C  -3.789522 -4.107083 0.154827
C  -4.089696 -2.044047 -1.115412
C  -4.576841 -3.305845 -0.706311
C  -2.785531 5.135556 1.614925
C  6.688184 0.347415 0.6073
H  -0.142159 -0.875584 -1.367604
H  -0.110374 1.537993 -2.14755
H  1.917726 -2.092938 -1.747895
H  -1.056764 0.493305 1.94962
H  1.825536 1.154582 1.12692
H  -1.139797 3.804078 -1.808133
H  4.432122 -2.082973 -1.668906
H  -2.056959 2.749353 2.309264
H  4.308272 1.149746 1.236429
H  -1.91253 -4.289999 1.244102
H  -2.490794 -0.581489 -0.971696
H  -4.152148 -5.089323 0.478464
H  -4.691512 -1.410207 -1.77667
H  -5.554013 -3.660733 -1.051399
H  -2.030708 5.130176 2.425424
H  -3.636799 4.485796 1.897292
H  -3.142572 6.162314 1.447769
H  6.493352 1.404611 0.340864
H  7.745134 0.107078 0.420794
H  6.45164 0.185047 1.676962
