program: Gaussian 09
title: 000292245
version: EM64L-G09RevD.01
frameworkgroup: C1[X(C18H25NO2)]
method: RPBEPBE
basis: SDD
operation: Freq
keyword: #p
keyword: freq=noraman
keyword: PBEPBE/SDD
title: #p freq=noraman PBEPBE/SDD
converged: NO YES NO NO
title: Mulliken charges:
elementType: O O N C C C C C C C C C C C C C C C C C C H H H H H H H H H H H H H H H H H H H H H H H H H
charge: -0.438491 -0.280714 -0.056610 0.403716 -0.184807 -0.323855 -0.563576 -0.539056 -0.436747 -0.455723 -0.683462 0.278239 -0.400706 -0.395338 0.436663 -0.649360 -0.094841 -0.500975 0.180050 -0.359842 -0.492999 0.209367 0.150551 0.231045 0.232220 0.212852 0.202617 0.212047 0.219760 0.220290 0.248634 0.252418 0.208544 0.197901 0.200969 0.185116 0.210658 0.228878 0.188919 0.227263 0.242316 0.248928 0.347651 0.228918 0.220783 0.229788
chargesum: 0.00000
title: Mulliken charges with hydrogens summed into heavy atoms:
elementType: O O N C C C C C C C C C C C C C C C C C C
charge: -0.090839 -0.280714 -0.056610 0.403716 0.024560 -0.173304 -0.100312 -0.123587 -0.004940 0.013201 -0.222500 0.278239 -0.001836 0.000436 0.436663 -0.004299 -0.094841 -0.258659 0.180050 -0.110914 0.186490
polarizability: 2.49259171e+02 2.96554880e+00 1.93784005e+02 -8.61947043e+00 1.40525868e+01 1.59692312e+02
1716.lowfreq: -57.9410 -14.5907 -0.0009 -0.0004 -0.0004 5.8631 9.7493 39.8970 63.4539
frequency: -57.9385 39.7225 63.3995 86.8399 116.0923 129.5583 131.3973 173.6735 182.8241 199.7073 206.5827 230.9656 263.4461 281.7888 298.5370 308.6094 313.0762 325.1201 345.9686 351.6334 355.5275 387.2425 407.3620 424.2930 447.8105 467.4872 497.2385 518.4687 545.1807 572.3744 596.2300 602.6315 616.4859 630.1183 687.6368 723.4957 728.9776 755.3098 777.6423 813.8208 826.0521 835.2422 846.2985 860.7932 885.0733 904.6664 933.8697 937.8580 943.1686 961.0529 969.5085 978.0533 998.8072 1005.6420 1016.1235 1037.1096 1053.2399 1072.4299 1087.5219 1104.2272 1109.4514 1113.3202 1121.3867 1131.8021 1138.1823 1144.6107 1155.2141 1170.5589 1179.8610 1189.8957 1205.3482 1219.6308 1223.0280 1235.8616 1250.8821 1254.0550 1264.2107 1267.9195 1278.5020 1281.3859 1290.8053 1313.3809 1321.0678 1333.1649 1335.0120 1339.5792 1342.5420 1348.6238 1355.1915 1396.0604 1422.8426 1430.0740 1439.4653 1454.2635 1457.0552 1458.7206 1463.9344 1464.7062 1465.0098 1468.9853 1471.7011 1475.5535 1479.7008 1484.2668 1491.3494 1591.9803 1616.2111 2869.3484 2869.9831 2952.9204 2956.7615 2962.3499 2966.3626 2986.8999 2987.1074 2994.3806 3005.5035 3011.5096 3018.6341 3023.5283 3027.4523 3031.4048 3045.0801 3046.8783 3054.3354 3070.2534 3076.8967 3099.9274 3116.8064 3131.5384 3166.3292 3545.6829
redmass: 3.0448 4.4570 3.9029 3.6383 2.9642 3.6730 2.9216 2.8299 2.7409 1.1241 1.1519 3.0287 2.9743 3.0225 3.4330 2.2943 2.9748 1.3700 2.5229 3.4113 2.4559 3.6615 2.3048 2.6462 3.9359 3.3707 2.2379 3.8233 4.2659 4.3493 5.3281 3.9547 2.4874 4.1049 4.5764 4.4191 3.1508 3.9383 2.2925 1.4933 2.1174 1.9586 2.4582 3.0395 1.8800 2.3513 1.9767 1.4484 2.7586 2.8660 2.7088 2.5303 1.9402 2.3897 2.3645 2.6213 2.2321 2.0110 1.9803 1.5256 1.2451 1.4995 2.2458 1.6813 1.9907 1.4841 1.3697 1.5844 1.4348 2.1142 1.7440 2.3680 1.5599 1.5337 1.3866 1.4183 1.5677 1.4903 1.7353 1.5554 1.5179 1.4535 1.2424 1.5219 1.3463 1.7318 1.4518 1.5311 1.3991 3.8432 3.9311 1.1864 1.2096 1.1150 1.0522 1.0880 1.0632 1.0880 1.0531 1.0916 1.0778 1.0954 1.0890 1.0534 2.9610 8.0051 6.7914 1.0646 1.0705 1.0646 1.0679 1.0643 1.0617 1.0620 1.0604 1.0286 1.0640 1.0845 1.0761 1.0948 1.0938 1.1023 1.1013 1.1010 1.0921 1.1046 1.1020 1.1047 1.1049 1.0888 1.0951 1.0648
irintensity: 7.8859 0.0593 0.2057 0.0933 0.3445 0.9114 1.1342 0.0555 1.0637 0.3402 0.0269 2.7009 0.8262 0.9038 3.6652 3.0931 12.5864 55.0316 32.3767 10.4342 0.7893 3.9867 1.8231 0.4354 4.1795 1.8268 0.4794 0.3659 0.1882 0.6281 3.4737 5.5964 2.0921 6.7703 3.3278 20.5703 3.6979 0.8493 4.9016 50.3894 1.0031 2.2297 9.6696 3.1360 2.2663 4.5216 0.5219 3.8862 11.5811 4.8130 23.5259 16.6002 8.4345 8.3070 12.5612 22.8643 8.2734 15.4792 9.1438 1.7875 0.1046 9.5660 17.0621 22.4379 2.4610 35.7028 1.4138 19.0278 4.5667 48.9466 72.8502 187.0890 56.0431 31.8613 8.0967 16.5960 12.7422 1.5612 6.6116 4.5283 6.5993 5.0757 0.7245 3.7509 0.0651 4.0967 1.7501 0.5933 18.1460 3.2707 45.8584 12.8700 8.1733 12.8191 10.3656 3.2147 27.8654 1.3135 40.2847 23.7242 13.7673 17.7816 21.9437 1.8785 80.9440 3.5742 25.2689 74.1515 86.7697 26.8730 28.4399 36.2485 28.2828 39.4884 24.2299 83.6390 60.6185 19.1043 89.8912 31.4574 69.8878 27.9899 16.0282 73.5362 8.4750 38.8397 51.0991 39.5383 32.0960 11.1229 10.4098 22.6510
temp: 298.150 k
press: 1.00000 atm
elementType: 8 8 7 6 6 6 6 6 6 6 6 6 6 6 6 6 6 6 6 6 6 1 1 1 1 1 1 1 1 1 1 1 1 1 1 1 1 1 1 1 1 1 1 1 1 1
symmnumber: 1
zpe: 1036715.2 jmol-1
zpe.correction: 0.394864 hartree
zpe.thermalcorrener: 0.413465 hartree
zpe.thermalcorrenthalpy: 0.414409 hartree
zpe.thermalcorrgfe: 0.349986 hartree
zpe.sumelectzpe: -904.483412 hartree
zpe.sumelectthermal: -904.464810 hartree
zpe.sumelectthermalent: -904.463866 hartree
zpe.sumelectthermalfe: -904.528289 hartree
dipole: 2.7381 2.4434 1.1963
dipole: 3.8599
quadrupole: -126.0536 -125.1872 -123.8702
quadrupole: -2.6048 -2.7967 1.4531
quadrupole: -1.0166 -0.1502 1.1668 -2.6048 -2.7967 1.4531
hfenergy: -904.8782755 hartree
pointgroup: C01 [X(C18H25N1O2)]
dipole: 1.1518658 -0.8834282 -0.4459894 debye
polarizability: 247.5452586|-2.8460591|191.33463|14.9316153|16.5345067|163.8555992 unknown
InChI: InChI=1S/C18H25NO2/c1-19-10-9-18-8-4-3-5-13(18)16-12(11-15(18)19)6-7-14(21-2)17(16)20/h6-7,13,15,20H,3-5,8-11H2,1-2H3
charge 0 multiplicity 1
46 atoms
O  -2.239862 -1.415111 -1.362023
O  -4.462922 0.377006 -0.557787
N  2.317569 2.245157 0.111004
C  1.729481 -0.113798 -0.422564
C  1.994506 0.930503 0.754251
C  0.453188 -1.002199 -0.18749
C  1.531149 0.806207 -1.683924
C  2.958557 -1.049596 -0.638207
C  0.647766 -2.118208 0.884971
C  1.508865 2.267018 -1.141602
C  0.789105 1.091358 1.729538
C  -0.755002 -0.131385 0.144987
C  3.150202 -2.108429 0.470087
C  1.890018 -2.991406 0.60449
C  -0.574687 0.915958 1.086234
C  3.760538 2.498927 -0.107654
C  -2.032579 -0.36062 -0.434713
C  -1.674546 1.736466 1.421529
C  -3.142956 0.463765 -0.08721
C  -2.937275 1.511388 0.842532
C  -4.89036 -0.652656 -1.518537
H  2.872127 0.621456 1.353024
H  0.310175 -1.534737 -1.159829
H  0.60307 0.564993 -2.233459
H  2.376489 0.668354 -2.384852
H  3.872041 -0.432137 -0.739833
H  2.829804 -1.579523 -1.606581
H  -0.267512 -2.740574 0.923726
H  0.746958 -1.656446 1.885316
H  1.920678 3.004119 -1.853202
H  0.473795 2.56584 -0.89802
H  0.871321 2.089504 2.19369
H  0.903104 0.349124 2.546855
H  3.353299 -1.612161 1.441555
H  4.036495 -2.731687 0.242247
H  1.74251 -3.561278 -0.33715
H  2.019439 -3.73668 1.412827
H  3.892104 3.534493 -0.470297
H  4.259744 1.817931 -0.840176
H  4.296216 2.414527 0.854686
H  -1.545399 2.554723 2.138654
H  -3.801416 2.134728 1.091803
H  -1.37769 -1.871908 -1.531599
H  -4.347939 -0.562515 -2.474459
H  -5.963324 -0.450756 -1.665527
H  -4.742344 -1.667938 -1.114217
