program: Gaussian 09
title: 000292339
version: EM64L-G09RevD.01
frameworkgroup: C1[X(C25H28N4O2)]
method: RPBEPBE
basis: SDD
operation: Freq
keyword: #p
keyword: freq=noraman
keyword: PBEPBE/SDD
title: #p freq=noraman PBEPBE/SDD
converged: YES YES NO NO
title: Mulliken charges:
elementType: O O N N N N C C C C C C C C C C C C C C C C C C C C C C C C C H H H H H H H H H H H H H H H H H H H H H H H H H H H H
charge: -0.223715 -0.234130 0.037570 0.030407 -0.380713 -0.392862 -0.449379 -0.450319 -0.560690 -0.558847 -0.546965 -0.546458 0.299495 0.299458 0.294351 0.294079 -0.580737 -0.584597 -0.418585 -0.414350 0.483539 0.495389 -0.401395 -0.406405 -0.411059 -0.392738 -0.375496 -0.537478 -0.557496 0.218664 0.260068 0.219468 0.215855 0.222464 0.223109 0.228254 0.234164 0.231667 0.224234 0.227731 0.227649 0.230236 0.228839 0.245907 0.239330 0.241658 0.243389 0.281332 0.282240 0.221159 0.210995 0.234147 0.227631 0.238041 0.234477 0.247828 0.241610 0.316501 0.291478
chargesum: 0.00000
title: Mulliken charges with hydrogens summed into heavy atoms:
elementType: O O N N N N C C C C C C C C C C C C C C C C C C C C C C C C C
charge: -0.223715 -0.234130 0.037570 0.030407 -0.064213 -0.101383 -0.014056 -0.004746 -0.098272 -0.102946 -0.091585 -0.087383 0.299495 0.299458 0.294351 0.294079 -0.334830 -0.345267 -0.176926 -0.170960 0.483539 0.495389 -0.120063 -0.124165 -0.189900 -0.181743 0.086282 -0.064961 -0.068058 0.218664 0.260068
polarizability: 5.50547827e+02 1.92284477e+01 2.62264343e+02 -6.44925118e+00 4.90911847e+01 2.13250556e+02
1716.lowfreq: -6.2275 -1.5039 -0.0004 -0.0003 0.0007 4.8530 13.5716 19.2755 23.5400
frequency: 12.9439 18.9519 23.0934 26.0133 39.8261 44.9146 52.2302 53.4255 62.7442 98.1355 121.3669 128.3158 138.1978 163.1436 163.4586 172.6639 178.1725 183.5549 194.9529 217.3862 222.4178 231.7635 244.7663 248.8228 269.1082 284.3553 344.0810 348.9490 360.5234 364.8040 389.6747 421.8395 424.0158 433.2302 437.5378 444.6192 469.9868 537.8162 540.0790 557.5805 564.0876 567.9238 590.1403 618.4335 618.9831 628.5163 644.2017 649.4034 653.6709 673.6953 715.7559 716.8621 736.4156 752.6979 753.0271 780.3363 786.0396 796.5556 846.5885 847.5201 853.2817 854.7560 861.5157 873.5574 875.3538 897.9065 901.7981 907.7012 911.4723 917.3202 922.4388 944.0942 953.5473 957.5496 959.3068 981.4742 986.9247 988.4607 1012.8322 1017.6732 1018.5271 1046.5793 1047.2015 1047.6008 1069.1979 1085.1832 1088.8722 1112.1794 1125.7289 1127.3815 1135.6644 1150.9384 1159.8668 1161.1145 1166.4526 1167.1913 1194.6994 1200.4625 1200.8481 1215.0895 1215.5455 1228.4226 1251.8170 1253.0931 1260.1996 1271.3574 1272.2226 1284.2170 1285.2181 1299.6127 1300.7108 1314.4232 1315.8358 1317.2266 1333.0778 1339.2667 1350.0437 1354.4764 1386.1648 1387.3967 1426.5165 1427.1232 1444.6953 1455.2566 1455.5348 1457.4673 1458.2635 1461.7053 1473.4466 1478.5541 1480.5403 1485.6969 1488.5884 1501.8467 1510.1340 1567.2608 1567.8604 1591.3338 1591.6430 1620.6216 1621.0899 1629.4584 1641.1821 2966.0642 2970.2142 2971.3299 2972.4652 2973.5667 2974.0011 2979.9768 2997.0633 3000.0555 3012.2357 3019.1641 3034.8088 3039.2993 3041.7474 3044.7219 3045.8147 3072.2468 3073.9343 3077.4799 3087.4966 3114.9742 3116.1381 3127.7182 3129.6787 3160.3879 3160.8720 3366.0346 3377.6005
redmass: 4.5803 4.6717 4.9837 5.6292 3.9268 6.1407 6.5730 4.9734 5.3676 4.8935 4.9699 5.5422 3.6309 2.3493 2.3568 2.9190 3.4372 3.5777 5.2042 4.1200 2.6136 2.8997 2.3417 3.4146 3.3834 3.3559 4.3692 4.6074 3.7914 3.7904 3.4794 2.7238 2.7630 3.0576 4.5970 5.1696 5.0795 4.2654 4.2918 3.2607 3.0203 3.1822 4.5311 2.3973 2.2635 1.3199 4.5783 4.4844 2.6539 1.2750 2.7879 2.7982 4.0200 3.1785 3.2095 4.1606 3.7536 2.3728 1.6391 1.8074 1.8092 1.6941 3.1770 1.4821 1.5038 1.5150 1.4863 2.9546 2.5689 2.4478 2.6599 1.5779 2.5854 3.2633 1.5272 3.3650 1.3705 1.3607 2.8711 2.2931 2.3359 2.2927 1.6903 1.9474 3.5443 2.6506 2.6744 3.0545 1.2791 1.2601 1.7120 1.7694 1.3428 1.3457 1.3294 1.3650 1.6070 1.4862 1.4817 1.4719 1.4534 1.6319 1.6166 1.5573 1.3001 1.3598 1.3790 2.2020 2.2418 1.4612 1.4427 1.3718 1.4765 1.4470 1.8238 1.7907 1.4099 1.4603 4.0763 3.7567 4.2827 4.3208 1.0920 1.0914 1.0907 1.1231 1.1513 1.1376 1.1686 1.1103 1.1069 2.0239 2.2374 2.1872 1.8733 6.4332 6.2895 6.2170 5.8858 6.9524 6.9335 6.4636 6.3317 1.0868 1.0661 1.0660 1.0673 1.0826 1.0660 1.0594 1.0653 1.0660 1.0605 1.0620 1.0984 1.0965 1.0962 1.0932 1.0938 1.1022 1.1030 1.1028 1.1045 1.0916 1.0916 1.0893 1.0892 1.0954 1.0955 1.0764 1.0757
irintensity: 2.3752 2.1577 0.0522 0.5904 0.2032 4.4602 4.4817 1.2721 1.6598 20.7544 1.3474 4.8103 4.6589 0.2537 0.2419 3.8019 2.6514 5.5410 7.4399 3.8256 11.7055 22.6617 12.5967 5.8012 2.6962 1.4859 3.3061 4.8161 0.1180 5.9235 1.9569 7.9999 0.6448 4.6560 1.1099 1.7660 0.1616 1.1317 4.8507 3.7696 4.2359 6.0956 9.5874 3.4907 7.6539 120.7450 1.5098 16.8708 17.0485 69.1697 12.8437 4.3557 11.1196 2.6203 3.6592 3.4496 4.0146 14.3733 9.1772 8.8683 3.2647 29.0411 9.7985 11.8747 3.7307 0.5801 1.3198 3.7578 7.7847 1.4164 0.8356 46.3010 15.6254 0.1054 42.6831 21.2511 7.0480 2.2435 4.2930 1.7047 0.5503 15.7384 5.5849 3.1529 16.5160 8.5255 0.3761 1.2181 1.7464 11.5756 371.2945 69.4140 3.9129 11.4498 13.3522 13.4672 32.4119 7.2500 0.8236 3.4023 6.3577 207.1273 17.2169 19.0795 14.6411 3.9022 14.7197 7.5560 8.5570 1.5974 7.3753 17.2761 17.3715 12.3573 12.0677 8.7527 5.7032 22.3070 0.4711 1.0420 3.8506 5.2784 18.3040 10.9302 24.2966 8.4371 12.6388 13.3227 107.1284 11.6502 6.1963 44.1721 104.5229 25.5915 253.6114 2.4993 44.2248 3.1757 8.3738 10.0866 6.7800 252.5580 232.4831 42.6319 47.5035 36.7428 14.7425 35.7183 57.6886 15.3788 32.9341 34.9164 28.3367 21.7001 27.2205 35.8737 18.3271 43.7783 37.8524 20.0498 62.1470 68.4993 26.4884 9.8188 15.8103 13.2762 11.8943 4.4314 3.8221 4.6231 7.7804
temp: 298.150 k
press: 1.00000 atm
elementType: 8 8 7 7 7 7 6 6 6 6 6 6 6 6 6 6 6 6 6 6 6 6 6 6 6 6 6 6 6 6 6 1 1 1 1 1 1 1 1 1 1 1 1 1 1 1 1 1 1 1 1 1 1 1 1 1 1 1 1
symmnumber: 1
zpe: 1264891.2 jmol-1
zpe.correction: 0.481772 hartree
zpe.thermalcorrener: 0.510324 hartree
zpe.thermalcorrenthalpy: 0.511268 hartree
zpe.thermalcorrgfe: 0.419127 hartree
zpe.sumelectzpe: -1336.651720 hartree
zpe.sumelectthermal: -1336.623168 hartree
zpe.sumelectthermalent: -1336.622224 hartree
zpe.sumelectthermalfe: -1336.714364 hartree
dipole: 6.0442 -1.5461 1.6583
dipole: 6.4555
quadrupole: -169.9327 -196.1920 -171.6882
quadrupole: 11.4109 -3.9945 -1.6306
quadrupole: 9.3383 -16.9210 7.5828 11.4109 -3.9945 -1.6306
hfenergy: -1337.1334918 hartree
pointgroup: C01 [X(C25H28N4O2)]
dipole: 1.9828281 -1.4047274 0.7386605 debye
polarizability: 524.4356485|-84.1625421|293.0260287|18.3069644|43.3328912|208.6010492 unknown
InChI: InChI=1S/C25H28N4O2/c30-24(28-26-16-18-10-12-20-4-1-6-22(20)14-18)8-3-9-25(31)29-27-17-19-11-13-21-5-2-7-23(21)15-19/h10-17,28-29H,1-9H2
charge 0 multiplicity 1
59 atoms
O  -4.087153 3.950375 -0.023502
O  -4.609323 -0.847902 -0.6732
N  -1.704975 2.55969 -0.699521
N  -2.079104 -1.305853 0.471647
N  -2.976027 2.173055 -1.096225
N  -3.020942 -0.438799 1.004823
C  5.290033 1.094783 0.189807
C  4.644651 -3.856091 0.097796
C  4.25878 0.493677 -0.81731
C  3.895825 -3.172623 1.285582
C  4.854319 2.583708 0.373003
C  3.542868 -4.653347 -0.669978
C  3.015418 1.343277 -0.584529
C  2.475017 -3.019813 0.755683
C  3.357188 2.54106 0.097696
C  2.273465 -3.869551 -0.364947
C  1.684678 1.090198 -0.959712
C  1.429831 -2.210009 1.233076
C  2.360151 3.494336 0.405201
C  1.017176 -3.910156 -1.011213
C  0.671101 2.041991 -0.645744
C  0.162848 -2.236728 0.581153
C  1.022272 3.24371 0.037341
C  -0.032636 -3.09487 -0.541045
C  -0.715958 1.749961 -1.025047
C  -0.908828 -1.364695 1.075076
C  -6.112768 1.528441 0.159364
C  -5.420579 2.171007 -1.080901
C  -5.154367 0.769149 1.111244
C  -4.122308 2.883669 -0.692331
C  -4.268368 -0.25105 0.384809
H  6.334049 0.994697 -0.154483
H  5.202548 0.569303 1.159941
H  5.480607 -4.494815 0.430951
H  5.061119 -3.077057 -0.568688
H  4.615151 0.614236 -1.8609
H  4.079649 -0.585394 -0.659143
H  3.901787 -3.826972 2.181191
H  4.355665 -2.213043 1.585131
H  5.361547 3.234392 -0.36901
H  5.102566 2.983167 1.373003
H  3.751771 -4.740278 -1.751463
H  3.457948 -5.686514 -0.274396
H  1.416979 0.159823 -1.477213
H  1.585682 -1.544648 2.092055
H  2.61881 4.421702 0.929617
H  0.856334 -4.565544 -1.875073
H  0.227181 3.960175 0.267754
H  -1.014893 -3.101034 -1.024441
H  -0.88676 0.80754 -1.585593
H  -0.673943 -0.748193 1.967991
H  -6.891422 0.836783 -0.208168
H  -6.611897 2.319005 0.748387
H  -5.239554 1.387478 -1.837938
H  -6.101746 2.921234 -1.519156
H  -5.75832 0.229148 1.867697
H  -4.52671 1.496206 1.662964
H  -3.111092 1.289604 -1.614471
H  -2.790843 0.138195 1.829159
