program: Gaussian 09
title: 000292294
version: EM64L-G09RevD.01
frameworkgroup: C1[X(C20H15NO4)]
method: RPBEPBE
basis: SDD
operation: Freq
keyword: #p
keyword: freq=noraman
keyword: PBEPBE/SDD
title: #p freq=noraman PBEPBE/SDD
converged: YES YES NO NO
title: Mulliken charges:
elementType: O O O O N C C C C C C C C C C C C C C C C C C C C H H H H H H H H H H H H H H H
charge: -0.310401 -0.417475 -0.259243 -0.436853 -0.149380 0.123881 0.156284 0.140074 0.459327 0.267611 0.109412 -0.410070 -0.392496 -0.148562 -0.573652 -0.394668 -0.376206 0.156172 0.342254 -0.302779 -0.354982 -0.404906 -0.228758 -0.234253 -0.236984 0.262831 0.281593 0.251599 0.267508 0.274014 0.192315 0.222973 0.193883 0.242617 0.245449 0.228802 0.228032 0.380499 0.230889 0.373648
chargesum: 0.00000
title: Mulliken charges with hydrogens summed into heavy atoms:
elementType: O O O O N C C C C C C C C C C C C C C C C C C C C
charge: -0.310401 -0.036976 -0.259243 -0.063205 -0.149380 0.123881 0.156284 0.140074 0.459327 0.267611 0.109412 -0.147239 -0.110903 -0.148562 -0.322054 -0.127160 0.090123 0.156172 0.342254 0.114077 -0.112365 -0.159457 0.000044 -0.006221 -0.006095
polarizability: 4.47287918e+02 -5.60563114e+00 2.49380629e+02 1.07974631e+01 1.00835431e+01 1.26386491e+02
1716.lowfreq: -4.8230 -0.0006 -0.0004 0.0003 1.4363 8.2306 29.0572 40.8508 50.0972
frequency: 28.9419 40.8454 50.0868 62.8657 69.7983 97.5395 108.6983 140.6896 171.7773 179.5774 215.2855 228.6542 235.3418 238.2439 293.8929 308.7720 345.7387 354.5002 376.5851 382.7339 398.0290 401.5984 416.5767 418.6605 468.7831 487.3838 510.7223 528.0530 545.4927 557.5186 575.5748 613.9380 627.3604 663.5329 669.7987 684.5438 689.9912 697.4473 703.6846 705.4221 752.4609 761.5611 764.7578 809.8218 828.9397 846.6729 848.8677 853.4456 870.3105 876.3555 899.8357 911.5930 921.9116 972.3446 979.6762 988.5752 993.7202 1002.1512 1015.3523 1030.1047 1039.7578 1053.9834 1077.8425 1085.5636 1148.2360 1154.0960 1173.8214 1174.4274 1193.0702 1199.7692 1208.6984 1225.7396 1253.8204 1266.7567 1285.3128 1308.6104 1314.4543 1338.8079 1342.0640 1346.5083 1375.9215 1377.1081 1383.9305 1413.7207 1425.4434 1430.6725 1442.1141 1451.2308 1468.0029 1477.9696 1487.5476 1505.0104 1548.3765 1565.4187 1582.0589 1589.9286 1609.7492 1618.7949 1660.8382 2939.4639 3018.8443 3056.5135 3087.7591 3123.8125 3131.3400 3143.4324 3149.1335 3154.9591 3155.8194 3162.1259 3168.1111 3170.2059 3285.5595 3342.4604
redmass: 5.3013 5.7962 4.4209 4.7332 5.8174 7.4731 5.4260 4.6798 5.2652 4.0595 4.8983 5.7815 5.7944 4.9250 4.2733 6.2669 6.0410 7.1121 5.7797 7.2139 4.8055 3.2741 4.9216 3.2153 3.6766 4.2834 5.4072 4.1348 5.8833 4.2513 5.3160 6.3646 5.7538 3.0941 2.6218 2.2145 1.2279 1.8334 3.7591 3.2236 4.3385 5.3574 2.0259 6.7317 3.9130 1.2553 1.3814 7.2526 1.5455 3.6674 1.6168 2.6503 1.4411 1.3858 4.1595 4.7115 1.4035 1.3736 3.8712 3.3041 2.5659 2.5128 2.5646 1.8376 2.9133 1.6862 1.1043 2.0888 1.1158 1.2616 1.4217 1.2800 1.7219 5.1604 2.4714 2.3496 1.6865 1.4839 1.6421 2.0177 6.6110 1.9035 6.7328 2.1948 1.2933 2.3141 2.5131 1.2526 1.1055 4.1238 2.8986 7.4757 7.2359 5.7641 6.1495 7.5542 6.1105 7.0497 7.1017 1.0697 1.0597 1.0939 1.1041 1.0856 1.0874 1.0921 1.0883 1.0965 1.0926 1.0929 1.1014 1.0969 1.0622 1.0658
irintensity: 1.0475 4.5094 0.3798 1.1458 0.3112 1.3732 1.5734 6.1990 2.2706 0.4792 4.5047 4.8399 0.3241 1.2609 4.3286 5.1218 22.3124 25.7520 11.3664 1.9203 7.7968 0.7143 4.7701 2.7134 3.0456 3.1858 17.5903 1.9247 6.7939 3.1294 13.3776 0.3506 22.3057 38.2387 28.7190 23.9493 76.5972 79.4217 66.4354 31.0834 17.0753 2.9136 47.0369 11.3127 2.0930 3.8163 0.8381 4.3801 21.9490 17.4610 34.6555 14.1272 0.8849 1.4304 80.4013 5.1736 1.2964 1.0425 4.1884 66.0720 110.4428 31.6827 1.6443 9.3662 3.9338 15.8966 13.6892 128.9472 8.1297 10.8501 85.8927 45.3089 77.6408 128.9646 26.8168 258.6906 54.9301 24.4120 73.8419 5.0703 2.9028 28.3990 124.1590 62.3588 319.6233 6.2449 16.4489 30.9601 6.4405 62.0827 0.6751 202.4552 98.9610 176.8202 11.9150 94.7681 8.8553 301.0334 56.6338 59.9971 17.4349 68.2404 15.0620 3.7195 0.4344 20.2300 1.9048 37.6286 6.3314 4.7955 23.2164 6.0894 81.6042 379.7295
temp: 298.150 k
press: 1.00000 atm
elementType: 8 8 8 8 7 6 6 6 6 6 6 6 6 6 6 6 6 6 6 6 6 6 6 6 6 1 1 1 1 1 1 1 1 1 1 1 1 1 1 1
symmnumber: 1
zpe: 795025.3 jmol-1
zpe.correction: 0.302809 hartree
zpe.thermalcorrener: 0.322792 hartree
zpe.thermalcorrenthalpy: 0.323736 hartree
zpe.thermalcorrgfe: 0.253736 hartree
zpe.sumelectzpe: -1125.076603 hartree
zpe.sumelectthermal: -1125.056621 hartree
zpe.sumelectthermalent: -1125.055677 hartree
zpe.sumelectthermalfe: -1125.125676 hartree
dipole: -0.6300 1.3034 1.2022
dipole: 1.8818
quadrupole: -147.2779 -150.8954 -143.3125
quadrupole: 32.6313 2.6298 4.6891
quadrupole: -0.1159 -3.7335 3.8494 32.6313 2.6298 4.6891
hfenergy: -1125.3794124 hartree
pointgroup: C01 [X(C20H15N1O4)]
dipole: -0.2228891 -0.423517 -0.5648619 debye
polarizability: 446.8262783|13.9272312|242.1293846|-4.7224853|31.8947754|134.0993749 unknown
InChI: InChI=1S/C20H15NO4/c22-9-8-21-11-13-10-16(23)19(24)18-14(12-4-2-1-3-5-12)6-7-15(17(13)18)20(21)25/h1-7,10-11,22-23H,8-9H2
charge 0 multiplicity 1
40 atoms
O  3.418105 2.168929 0.170848
O  -1.025898 -4.22062 -0.389694
O  -2.556292 -2.135398 0.043305
O  6.009616 1.841516 0.944042
N  3.552815 -0.123567 -0.282765
C  0.715852 -0.36955 -0.103907
C  -0.720279 -0.483329 -0.034795
C  1.349799 0.900871 0.061503
C  1.554631 -1.535322 -0.329082
C  -1.508262 0.697621 0.170616
C  2.811405 1.056725 -0.006798
C  2.934913 -1.355607 -0.417888
C  0.559537 2.048322 0.317353
C  -1.309619 -1.842653 -0.098519
C  0.967088 -2.849773 -0.44948
C  -0.835838 1.940527 0.367841
C  5.036618 -0.011651 -0.435492
C  -0.395032 -2.991767 -0.324045
C  -3.002433 0.75427 0.151818
C  5.793644 0.4088 0.855236
C  -3.749631 0.280648 -0.958897
C  -3.691516 1.397922 1.214176
C  -5.14809 0.444092 -1.003016
C  -5.096157 1.540953 1.181112
C  -5.829222 1.068976 0.069299
H  3.598881 -2.204348 -0.603743
H  1.065433 3.009282 0.452891
H  1.599484 -3.727374 -0.616723
H  -1.443558 2.837557 0.52223
H  5.255666 0.736414 -1.219241
H  5.386024 -0.998503 -0.784226
H  6.80212 -0.040158 0.832716
H  5.25595 0.005686 1.742362
H  -3.2332 -0.212543 -1.788456
H  -3.128169 1.759388 2.082607
H  -5.7088 0.079073 -1.870399
H  -5.613969 2.019767 2.019441
H  -2.004875 -4.028895 -0.242744
H  -6.918327 1.184496 0.037257
H  5.128288 2.276427 0.742758
