program: Gaussian 09
title: 000292195
version: EM64L-G09RevD.01
frameworkgroup: C1[X(C5H4N2O4S)]
method: RPBEPBE
basis: SDD
operation: Freq
keyword: #p
keyword: freq=noraman
keyword: PBEPBE/SDD
title: #p freq=noraman PBEPBE/SDD
converged: NO YES NO YES
title: Mulliken charges:
elementType: S O O O O N N C C C C C H H H H
charge: 0.375925 -0.191068 -0.200034 -0.187656 -0.201982 0.038035 0.086904 -0.162762 0.379360 -0.275426 -0.081988 -0.691873 0.339706 0.271290 0.271312 0.230258
chargesum: 0.00000
title: Mulliken charges with hydrogens summed into heavy atoms:
elementType: S O O O O N N C C C C C
charge: 0.375925 -0.191068 -0.200034 -0.187656 -0.201982 0.038035 0.086904 -0.162762 0.379360 0.064280 -0.081988 0.080987
polarizability: 1.58702294e+02 -4.39581019e+00 1.24955079e+02 3.11217905e-03 1.40637948e-03 4.13826437e+01
1716.lowfreq: -8.0466 -0.0029 -0.0017 0.0012 3.1520 4.4904 54.5991 71.7497 115.2223
frequency: 54.5410 71.7422 115.2146 134.4021 137.9897 158.3913 225.6012 291.7681 309.4820 321.2808 369.6266 443.8274 456.1662 492.1479 558.3370 639.0055 676.3534 683.6444 705.3919 715.5556 730.5858 840.5998 926.9078 1006.9082 1012.9310 1072.6925 1144.8793 1167.3883 1213.4427 1221.8761 1342.4938 1358.4293 1376.0653 1399.9210 1439.4777 1457.4904 1499.5738 1542.1344 2995.4385 3076.1334 3107.3268 3223.0210
redmass: 10.0181 12.0536 5.2221 13.8376 1.0818 6.7931 6.0733 5.8939 4.1909 12.3207 11.5435 15.5166 5.1443 8.2842 5.1556 7.4996 10.3424 5.7846 7.7293 8.6751 10.1762 4.5124 1.3901 2.6570 1.4348 3.1926 2.3098 2.7831 12.6534 8.6998 8.0729 13.9728 6.6946 1.1890 1.0439 1.0994 10.4955 7.8502 1.0366 1.0960 1.1011 1.0964
irintensity: 0.1165 1.2807 0.7622 6.0229 1.7594 3.9940 0.7417 1.3942 1.4545 0.6540 0.3306 0.8486 7.4863 1.4718 0.3009 20.3981 18.4861 8.7160 14.3254 3.4962 9.0201 3.5686 28.5015 14.2015 4.2692 3.1721 22.8008 90.1608 375.7966 129.2093 161.7656 45.8804 81.4397 15.7358 17.1048 13.5081 118.0887 49.9296 0.6595 1.4483 12.7824 22.1032
temp: 298.150 k
press: 1.00000 atm
elementType: 16 8 8 8 8 7 7 6 6 6 6 6 1 1 1 1
symmnumber: 1
zpe: 249518.2 jmol-1
zpe.correction: 0.095036 hartree
zpe.thermalcorrener: 0.106233 hartree
zpe.thermalcorrenthalpy: 0.107177 hartree
zpe.thermalcorrgfe: 0.056915 hartree
zpe.sumelectzpe: -1000.320016 hartree
zpe.sumelectthermal: -1000.308820 hartree
zpe.sumelectthermalent: -1000.307876 hartree
zpe.sumelectthermalfe: -1000.358138 hartree
dipole: -1.8766 3.9487 -0.0030
dipole: 4.3719
quadrupole: -100.4194 -75.7285 -73.3066
quadrupole: -7.0746 -0.0052 0.0031
quadrupole: -17.2679 7.4230 9.8449 -7.0746 -0.0052 0.0031
hfenergy: -1000.4150528 hartree
pointgroup: C01 [X(C5H4N2O4S1)]
dipole: 0.7339082 1.5556217 0.0015754 debye
dipolederiv: -0.1608822 0.1111943 0.0000749 0.0541087 0.0317639 -0.0000044 0.0001422 -0.0000266 0.2023862 -0.4863423 0.0916726 0.0000556 0.1472666 -0.8327705 0.0000035 0.000082 -0.0002972 -0.2260059 -0.8355664 -0.0825594 -0.0000671 -0.0974018 -0.4956306 -0.0001195 0.0002136 0.0000658 -0.2148044 -0.6228939 -0.1924109 -0.0000815 -0.3302755 -0.7428607 0.0002417 -0.0004327 -0.0006689 -0.2124695 -0.7888587 0.1229412 0.0001111 0.151669 -0.5399102 -0.000309 -0.0004105 0.0002782 -0.2191638 1.556559 -0.302626 -0.0001336 -0.332927 1.292739 0.0001841 -0.0002594 0.0001857 0.2109536 1.9139988 0.2360807 0.000302 0.2704733 1.0400291 0.0000956 0.000345 0.000241 0.2240772 0.4260915 -0.0078199 -0.0000823 0.0215219 0.616833 0.0001569 -0.0000078 0.0001446 -0.0763843 -0.6191727 0.1817637 0.0000899 -0.0077769 -0.6298988 -0.0001771 -0.0000407 -0.000045 0.0387391 0.5292261 0.1340241 0.0000422 -0.0089888 -0.1997471 -0.0000817 0.0001453 0.0000651 -0.0340333 -1.0320647 -0.1318323 -0.0002668 0.2438581 0.2690236 0.0000564 0.0002701 0.0001405 -0.0906202 -0.2448006 -0.3272144 -0.000042 -0.0861996 -0.0189528 -0.0000149 -0.0000982 -0.000064 0.0090255 0.1512263 0.0162718 0.0000004 -0.0260006 0.1402744 -0.0000104 0.0000091 -0.0000297 0.2109471 0.0761017 0.0075978 -0.068213 -0.0125857 0.0615199 0.03846 -0.0540193 0.0216541 0.0253008 0.0761223 0.0076065 0.0682206 -0.0125433 0.0615536 -0.0384922 0.0540505 -0.0216564 0.0253562 0.0612557 0.1353103 -0.0000102 0.0258017 -0.0539657 0.0000111 0.0000106 0.0000127 0.1266954 unknown
polarizability: 158.6770773|4.491488|124.9802913|0.009304|0.0180621|41.3826481 unknown
InChI: InChI=1S/C5H4N2O4S/c1-3-4(6(8)9)2-5(12-3)7(10)11/h2H,1H3
charge 0 multiplicity 1
16 atoms
S  -0.862164 1.745653 0.000552
O  2.220732 -2.13939 -0.000553
O  3.348337 -0.149632 -0.000278
O  -3.035374 -1.612088 -0.000998
O  -3.595767 0.617683 -0.000734
N  2.25882 -0.848634 0.000096
N  -2.738792 -0.35554 0.000449
C  0.872491 1.26502 0.000359
C  0.979588 -0.135418 0.000231
C  -0.259802 -0.858373 0.000224
C  -1.338902 0.002813 0.000396
C  1.926729 2.328972 0.000397
H  -0.33401 -1.94602 0.000113
H  2.584147 2.222724 0.881745
H  2.584308 2.222634 -0.880816
H  1.484959 3.338796 0.000315
