program: Gaussian 09
title: 000292196
version: EM64L-G09RevD.01
frameworkgroup: C1[X(C5H4N2O4S)]
method: RPBEPBE
basis: SDD
operation: Freq
keyword: #p
keyword: freq=noraman
keyword: PBEPBE/SDD
title: #p freq=noraman PBEPBE/SDD
converged: NO NO NO NO
title: Mulliken charges:
elementType: S O O O O N N C C C C C H H H H
charge: 0.481619 -0.190136 -0.195582 -0.187563 -0.191104 0.081936 0.085246 0.534726 -0.303643 -0.352351 -0.088313 -0.747861 0.315158 0.229285 0.264260 0.264323
chargesum: 0.00000
title: Mulliken charges with hydrogens summed into heavy atoms:
elementType: S O O O O N N C C C C C
charge: 0.481619 -0.190136 -0.195582 -0.187563 -0.191104 0.081936 0.085246 0.534726 -0.303643 -0.037192 -0.088313 0.010007
polarizability: 1.64522404e+02 -1.91683295e-01 1.24527394e+02 -2.46138431e-02 -3.04303599e-03 4.13193663e+01
1716.lowfreq: -7.3572 -5.7709 -0.0018 -0.0007 0.0026 8.9516 64.1282 71.4846 99.8887
frequency: 64.1135 71.4298 99.8861 131.2949 136.4652 188.1768 212.9006 280.8149 294.7201 309.8636 428.3654 440.1426 440.4337 492.5197 562.2881 585.9188 675.7677 679.2475 694.0000 725.6236 738.2545 894.5626 934.6243 1018.6292 1037.9414 1054.6185 1083.1076 1194.4237 1207.1872 1231.5758 1333.7042 1355.2074 1377.3812 1409.2855 1445.6096 1451.6207 1471.7479 1544.8689 3002.4163 3083.7810 3114.1972 3200.9096
redmass: 6.6348 9.7650 12.8297 1.1328 13.3595 4.2069 6.3950 7.3145 13.9885 4.2738 12.6959 14.0189 7.4021 7.6147 5.7016 3.4805 11.0684 7.7372 10.8415 9.1453 10.7404 1.3488 3.8651 1.9284 1.5224 7.0046 4.7072 2.5414 3.5367 8.1677 8.6192 14.0945 3.9154 1.2640 6.4520 1.0435 1.2587 6.9442 1.0368 1.0961 1.1015 1.0961
irintensity: 0.3651 2.0166 3.1550 1.0229 5.4995 0.0389 0.8178 1.3193 1.0366 2.6289 3.1152 3.5085 0.8664 1.0638 0.9371 8.4668 3.2220 2.5947 13.2135 11.2828 24.5623 20.7963 8.9212 7.1417 11.0359 8.9773 1.9329 322.1709 264.5400 47.1208 111.5502 62.2675 133.8042 1.6552 5.2941 16.6440 9.2755 35.1509 2.6977 3.3807 17.1264 3.3472
temp: 298.150 k
press: 1.00000 atm
elementType: 16 8 8 8 8 7 7 6 6 6 6 6 1 1 1 1
symmnumber: 1
zpe: 249419.2 jmol-1
zpe.correction: 0.094999 hartree
zpe.thermalcorrener: 0.106202 hartree
zpe.thermalcorrenthalpy: 0.107146 hartree
zpe.thermalcorrgfe: 0.056975 hartree
zpe.sumelectzpe: -1000.314665 hartree
zpe.sumelectthermal: -1000.303462 hartree
zpe.sumelectthermalent: -1000.302518 hartree
zpe.sumelectthermalfe: -1000.352689 hartree
dipole: 0.8666 3.8712 -0.0029
dipole: 3.9670
quadrupole: -102.1994 -73.7242 -73.3948
quadrupole: 4.9286 0.0290 -0.0023
quadrupole: -19.0933 9.3819 9.7113 4.9286 0.0290 -0.0023
hfenergy: -1000.4096638 hartree
pointgroup: C01 [X(C5H4N2O4S1)]
dipole: 0.3113401 -1.5293691 0.0011344 debye
dipolederiv: 0.2626932 0.0422546 0.0001248 0.0682372 -0.1579039 0.0000431 0.0005516 0.0000557 0.2629914 -0.8453317 0.1265477 0.0003853 0.1604505 -0.4849079 -0.0004618 -0.0005573 0.000544 -0.202256 -0.5645763 -0.111633 -0.0000166 -0.1880632 -0.7573427 0.0004968 -0.0001723 -0.0008633 -0.2170389 -0.8058488 -0.1804497 0.0003404 -0.2296838 -0.5612856 0.0009097 -0.0010002 -0.0009688 -0.2098548 -0.6527241 0.1317277 0.0000303 0.1906084 -0.6365115 -0.0007595 -0.0005704 0.0012361 -0.2112897 1.7206789 0.243413 -0.0001017 0.34131 1.1490236 0.0000577 -0.0004476 -0.0000721 0.2080855 1.9143408 -0.0197933 0.0002669 -0.1552982 1.0046254 -0.0003339 -0.0001231 -0.0001128 0.2157647 0.1349234 -0.3953836 -0.0000689 -0.0426849 0.2487188 0.0000938 0.0003286 0.0004151 0.0484997 -0.6243449 -0.3999472 -0.0003667 -0.4118694 -0.0268415 -0.0000358 0.0007775 0.0003407 -0.1011287 -0.009268 0.2972702 -0.0000664 -0.0289917 -0.170608 -0.000134 0.0006343 -0.0002349 -0.0887311 -0.7618493 0.1562965 -0.0005686 0.3073663 0.2953015 0.0001119 0.0008208 -0.0002067 -0.0642921 0.0009183 0.2873911 -0.0000251 0.1046418 -0.0371025 -0.000063 -0.0002893 -0.0000124 0.0199525 0.1081777 -0.0185648 0.0000205 -0.033502 0.0764983 0.0000477 -0.000064 0.000005 0.1989185 0.0191475 -0.1450838 0.0000948 -0.0371053 -0.058407 0.0000473 0.0000671 0.0000311 0.1194172 0.0516034 -0.0069936 0.0780117 -0.0226795 0.0583307 0.0324809 0.069043 0.0013833 0.0103432 0.0514598 -0.0070518 -0.0780608 -0.0227361 0.0584124 -0.032501 -0.0689987 -0.00154 0.0106186 unknown
polarizability: 164.5147825|-0.58438|124.5350157|0.0245502|-0.0035201|41.3193663 unknown
InChI: InChI=1S/C5H4N2O4S/c1-3-2-4(6(8)9)12-5(3)7(10)11/h2H,1H3
charge 0 multiplicity 1
16 atoms
S  -0.237274 1.385911 0.000183
O  3.433049 -0.152493 0.000628
O  2.592727 1.984079 0.000851
O  -3.559818 -0.825666 -0.001355
O  -3.193937 1.443426 -0.001848
N  2.453374 0.694669 -0.001159
N  -2.790764 0.212754 0.001658
C  0.701716 -1.16966 0.000038
C  1.104393 0.175397 -0.000393
C  -0.733355 -1.255765 0.000759
C  -1.358903 -0.016284 0.000957
C  1.59948 -2.380576 -0.000235
H  -1.289497 -2.195233 0.001161
H  0.999173 -3.304387 0.000225
H  2.265504 -2.382373 -0.880517
H  2.266428 -2.3821 0.879347
