program: Gaussian 09
title: 000292194
version: EM64L-G09RevD.01
frameworkgroup: C1[X(C6H4BrNO4S)]
method: RPBEPBE
basis: SDD
operation: Freq
keyword: #p
keyword: freq=noraman
keyword: PBEPBE/SDD
title: #p freq=noraman PBEPBE/SDD
converged: NO YES NO NO
title: Mulliken charges:
elementType: Br S O O O O N C C C C C C H H H H
charge: 0.193421 0.411233 -0.267892 -0.237932 -0.201431 -0.190970 0.037799 -0.255652 0.621234 -0.281463 -0.702773 0.297829 -0.493041 0.332272 0.248123 0.248119 0.241125
chargesum: 0.00000
title: Mulliken charges with hydrogens summed into heavy atoms:
elementType: Br S O O O O N C C C C C C
charge: 0.193421 0.411233 -0.267892 -0.237932 -0.201431 -0.190970 0.037799 -0.255652 0.621234 0.050809 -0.702773 0.297829 0.244326
polarizability: 1.97304601e+02 -3.35356314e+00 1.35737859e+02 1.20488856e-02 -2.29509720e-03 4.72977504e+01
1716.lowfreq: -3.9305 -0.0018 -0.0014 -0.0012 2.4230 4.2497 35.6122 49.3740 69.7810
frequency: 35.6007 49.3723 69.7770 87.3018 91.7993 131.2615 146.2902 168.2261 209.5836 262.1034 285.5563 288.8455 326.4259 382.5215 420.8778 469.7268 558.4319 586.3087 657.5554 699.3095 702.8676 718.6844 733.3646 851.5787 874.6251 914.8077 967.5972 1031.0871 1113.3130 1134.1009 1149.4379 1202.7201 1241.7642 1323.2011 1372.2106 1424.2866 1452.9364 1455.3787 1461.7629 1545.0292 1623.1241 3009.8790 3114.0373 3157.5585 3219.6100
redmass: 15.5187 5.6309 2.0314 6.2508 1.8876 6.7147 21.2519 5.2648 10.0292 8.8684 10.3571 6.0679 13.8624 13.0214 14.9504 7.4470 5.7868 6.8225 9.7571 7.3046 9.2940 11.3640 6.1519 10.9968 9.6816 1.4201 10.8937 6.2528 1.2597 1.5586 1.4354 11.5828 7.2158 6.3394 11.6320 1.2053 1.0493 7.8772 1.0967 7.9930 10.3054 1.0295 1.1049 1.1051 1.0958
irintensity: 0.0021 2.5011 0.0006 2.5176 0.9069 0.1188 0.6458 10.4945 2.1068 5.5620 2.3611 20.3482 0.3747 0.4981 2.2104 7.3846 1.2900 14.8701 6.5966 30.7785 17.9018 0.5184 0.7336 13.3053 6.3698 23.3815 26.0411 173.2391 0.0259 135.9034 22.6135 305.5766 206.3103 103.3423 60.0794 19.1178 16.1210 191.5189 1.4044 32.2962 242.6279 32.2838 22.2220 11.0754 16.3422
temp: 298.150 k
press: 1.00000 atm
elementType: 35 16 8 8 8 8 7 6 6 6 6 6 6 1 1 1 1
symmnumber: 1
zpe: 255533.3 jmol-1
zpe.correction: 0.097328 hartree
zpe.thermalcorrener: 0.110553 hartree
zpe.thermalcorrenthalpy: 0.111497 hartree
zpe.thermalcorrgfe: 0.054627 hartree
zpe.sumelectzpe: -997.137344 hartree
zpe.sumelectthermal: -997.124118 hartree
zpe.sumelectthermalent: -997.123174 hartree
zpe.sumelectthermalfe: -997.180044 hartree
dipole: -2.9979 -1.5530 0.0002
dipole: 3.3763
quadrupole: -76.5458 -104.7199 -89.0278
quadrupole: -16.3941 0.0006 -0.0010
quadrupole: 13.5520 -14.6221 1.0701 -16.3941 0.0006 -0.0010
hfenergy: -997.2346712 hartree
pointgroup: C01 [X(C6H4Br1N1O4S1)]
dipole: -1.2961714 0.2904714 -0.0000783 debye
dipolederiv: -0.3391578 -0.3170502 0.0001109 -0.3282729 -0.1662811 0.0000749 0.0001707 0.0001285 0.1428262 -0.1165539 0.1058337 0.0000579 0.0249315 -0.0262875 0.0000148 0.0000948 0.0000054 0.2224919 -1.1931388 -0.4279784 -0.0000758 -0.8690907 -0.9891982 -0.0000274 -0.0003396 -0.0002454 -0.2897995 -0.9235333 0.2111171 0.0001589 0.0670628 -0.7561387 -0.0001737 -0.0000526 0.0001353 -0.3155255 -0.4581794 0.0321993 -0.000047 0.0281311 -0.8875374 -0.0001034 -0.0000149 -0.0000073 -0.2302779 -0.8209048 0.0899433 -0.0000668 -0.0011446 -0.4354169 -0.000026 -0.0000643 -0.0000418 -0.2132908 1.3713338 -0.4949263 0.0001486 -0.2789225 1.4858583 0.0001586 0.0000621 0.0001258 0.2144923 -0.9652199 0.0539178 0.0000241 0.3567084 0.165995 -0.0000627 0.0001663 -0.0000066 -0.1488562 -0.5529317 0.1425084 0.0000217 0.1352581 -0.7527008 0.0000228 0.0000837 0.0000208 0.1187452 0.3486157 -0.0076391 -0.0000551 -0.1050498 -0.2182229 0.0000318 0.0000736 -0.0000248 -0.0513569 0.7243808 0.3279999 -0.0002152 0.2747819 0.802395 -0.0001375 -0.0002856 -0.0001715 -0.2374435 2.0602148 0.1461142 -0.0001681 0.5557338 1.3245424 0.0002034 -0.0000097 0.0000687 0.280947 0.7464062 0.2410004 0.0000802 0.1797373 0.2940818 0.0000111 0.0000158 -0.0000476 0.2772439 0.1595373 0.0166994 0.0000141 -0.0428566 0.1170182 0.000006 0.0000108 0.0000098 0.197282 -0.0445315 -0.0512223 -0.0339444 0.0429382 0.0675271 0.0920447 -0.0695884 0.0522856 -0.0469058 -0.0447148 -0.0513127 0.0339665 0.043059 0.0676824 -0.0919871 0.0697412 -0.0521561 -0.0469235 0.0483773 -0.0172043 -0.0000105 -0.083005 -0.0933164 -0.0000501 -0.0000641 -0.0000789 0.1263511 unknown
polarizability: 191.6591056|18.0817455|141.3833538|-0.011067|-0.0052881|47.2977504 unknown
InChI: InChI=1S/C6H4BrNO4S/c1-12-6(9)4-2-3(8(10)11)5(7)13-4/h2H,1H3
charge 0 multiplicity 1
17 atoms
Br 3.001582 2.293905 -0.000494
S  -0.152993 1.98912 0.000052
O  -2.884578 -0.997649 0.00019
O  -3.17333 1.327767 0.000207
O  2.105302 -2.427768 -0.000222
O  3.643983 -0.737861 0.000098
N  2.431562 -1.175454 -0.000105
C  -0.95572 0.363038 0.000312
C  1.327857 -0.2071 -0.00003
C  -0.034187 -0.667715 0.000209
C  1.454473 1.188111 -0.000141
C  -2.425919 0.317757 0.000576
C  -4.361068 -1.15522 -0.000177
H  -0.303785 -1.723807 0.00032
H  -4.792022 -0.685463 -0.89976
H  -4.792421 -0.685825 0.899404
H  -4.524238 -2.241335 -0.000434
