program: Gaussian 09
title: 000292207
version: EM64L-G09RevD.01
frameworkgroup: C1[X(C19H23NO)]
method: RPBEPBE
basis: SDD
operation: Freq
keyword: #p
keyword: freq=noraman
keyword: PBEPBE/SDD
title: #p freq=noraman PBEPBE/SDD
converged: YES YES NO NO
title: Mulliken charges:
elementType: O N C C C C C C C C C C C C C C C C C C C H H H H H H H H H H H H H H H H H H H H H H H
charge: -0.268171 -0.276412 -0.002287 -0.389650 -0.400970 -0.433823 -0.436956 -0.525719 -0.169935 -0.332620 0.327482 0.191518 0.437321 -0.425026 -0.529395 -0.458841 -0.264150 -0.444268 0.320074 -0.376917 -0.536879 0.191845 0.202631 0.206980 0.186833 0.209071 0.170588 0.213629 0.212680 0.172845 0.201960 0.210422 0.262084 0.227925 0.216782 0.234734 0.251655 0.238876 0.223460 0.234036 0.241300 0.245305 0.220264 0.219719
chargesum: 0.00000
title: Mulliken charges with hydrogens summed into heavy atoms:
elementType: O N C C C C C C C C C C C C C C C C C C C
charge: -0.268171 -0.014328 0.189558 0.019962 -0.005066 -0.049607 -0.051431 -0.113337 0.057990 -0.115838 0.327482 0.191518 0.437321 -0.190292 -0.277740 -0.219964 -0.040690 -0.210233 0.320074 -0.135617 0.148409
polarizability: 3.35454879e+02 1.19319020e+01 2.43129202e+02 -2.50809493e+01 2.23094386e+00 1.33158162e+02
1716.lowfreq: -4.6348 -0.0004 0.0003 0.0006 4.6323 7.8792 20.0163 34.3613 38.2629
frequency: 18.5840 34.0935 38.2030 66.0937 69.1330 85.4649 123.1561 155.3564 179.8427 193.2522 204.6137 222.4770 226.8947 246.5510 265.0145 304.6860 324.2226 340.9077 372.4317 382.2606 419.5423 429.7057 447.5788 451.1517 477.7999 517.9656 530.1192 538.3422 542.5521 561.8948 626.4381 668.9185 683.3379 686.4154 743.7649 757.9519 776.5240 790.0055 808.6599 828.4396 845.5208 848.1915 871.5675 877.8035 886.5590 895.2118 912.5525 937.3630 951.9447 966.3555 977.4056 980.5230 983.1982 1005.4886 1017.5911 1050.2306 1060.7197 1074.6738 1090.0365 1107.5356 1111.0971 1128.0470 1142.3596 1142.6876 1162.7880 1166.4280 1177.0196 1179.6163 1196.5750 1201.7938 1239.2078 1254.8420 1258.5371 1261.7472 1268.4760 1276.5112 1300.8515 1303.3458 1310.0911 1319.0285 1324.5916 1342.4999 1352.0279 1354.2869 1387.9357 1406.4196 1416.8919 1431.9801 1441.9048 1443.1136 1447.8909 1452.4480 1458.0229 1459.5582 1468.2138 1469.3305 1473.8830 1476.9059 1514.2002 1579.0369 1595.2911 1636.0333 1656.2859 2831.3342 2839.0052 2929.6380 2943.4972 2958.1903 2973.8461 2981.7401 3014.6089 3027.6242 3031.8400 3038.3382 3045.7414 3047.8036 3071.5693 3095.5623 3120.6727 3122.4397 3126.3604 3134.5712 3156.5228 3163.2523 3170.2500 3452.6329
redmass: 3.8694 4.6940 3.3062 4.2197 3.3350 3.6479 3.3297 3.1086 3.2707 3.0011 3.6762 2.7862 1.4183 1.8088 2.5825 3.7350 2.1394 3.0603 4.3310 3.0427 3.4104 3.0035 2.4545 2.9583 3.7426 3.4976 2.7836 3.3252 3.0419 2.6345 4.7380 3.3731 1.8249 5.9342 4.2376 1.4969 1.9588 1.7660 1.4767 1.9298 3.6548 2.1812 2.7275 3.0670 1.8791 2.5656 1.4230 1.6949 1.3789 1.1619 1.3687 1.8707 1.7715 5.4908 2.5112 1.9381 1.7947 2.5222 2.1214 2.3108 1.2569 2.4864 1.4238 1.4376 1.8670 1.2592 1.3210 1.5345 1.9948 1.2046 1.7746 1.2472 1.4904 2.1391 1.3508 1.4459 1.3011 1.2911 1.3473 1.2779 1.5167 1.5326 1.6818 2.0763 1.4265 3.6104 4.5940 1.3787 1.1746 2.4054 1.2280 1.1349 1.5501 1.4288 1.0560 1.0775 1.0782 1.1019 3.7607 7.6550 5.4236 6.8946 6.1912 1.0721 1.0700 1.0820 1.0621 1.0330 1.0593 1.0607 1.0970 1.0874 1.0891 1.1023 1.1040 1.1021 1.0909 1.0874 1.0861 1.0985 1.0889 1.0910 1.0989 1.0945 1.0907 1.0752
irintensity: 0.5434 0.1805 0.2645 1.7941 3.6299 2.0048 1.7008 0.5850 0.1666 2.1422 0.7506 0.6621 0.4165 0.6037 1.2466 2.6989 3.1425 3.1592 4.8583 0.5341 9.9941 3.7749 1.8393 5.7229 10.4584 12.7589 18.6602 13.8191 30.2545 7.5362 7.8665 6.6149 72.2898 9.9545 0.6045 20.8161 1.5506 5.8828 2.4509 37.1779 11.0131 37.6191 1.8295 7.1002 13.0557 4.8447 1.1856 8.8212 3.2083 45.4972 8.3798 4.1559 6.3015 82.7404 2.7346 6.0546 5.5928 9.5986 0.7850 1.1800 0.2186 10.3854 9.1993 9.0553 4.4657 42.6431 23.8985 9.3614 126.2383 1.7705 5.9196 2.3971 0.9349 118.1624 12.0211 1.0900 2.5241 2.1523 2.1778 26.8577 2.6948 0.4546 18.6934 3.0517 3.9890 0.5138 1.1273 18.6320 5.5417 3.3728 0.6836 1.4959 2.8614 61.2940 12.8250 0.4725 35.8070 7.0332 74.3084 1.0623 35.3350 110.1850 9.5205 56.0107 176.1075 25.7145 35.7904 95.9355 42.9147 27.2620 12.5163 92.9889 30.5112 38.1923 50.0722 62.0429 19.7526 27.7453 0.2107 29.0483 4.4550 23.8759 35.7954 21.4534 3.9928 3.7938
temp: 298.150 k
press: 1.00000 atm
elementType: 8 7 6 6 6 6 6 6 6 6 6 6 6 6 6 6 6 6 6 6 6 1 1 1 1 1 1 1 1 1 1 1 1 1 1 1 1 1 1 1 1 1 1 1
symmnumber: 1
zpe: 979428.5 jmol-1
zpe.correction: 0.373045 hartree
zpe.thermalcorrener: 0.392430 hartree
zpe.thermalcorrenthalpy: 0.393375 hartree
zpe.thermalcorrgfe: 0.323798 hartree
zpe.sumelectzpe: -866.223874 hartree
zpe.sumelectthermal: -866.204488 hartree
zpe.sumelectthermalent: -866.203544 hartree
zpe.sumelectthermalfe: -866.273120 hartree
dipole: -0.8655 0.4523 -0.0970
dipole: 0.9814
quadrupole: -90.6595 -118.4762 -130.5401
quadrupole: 10.3009 -5.8209 0.7644
quadrupole: 22.5658 -5.2510 -17.3149 10.3009 -5.8209 0.7644
hfenergy: -866.5969183 hartree
pointgroup: C01 [X(C19H23N1O1)]
dipole: -0.3430422 -0.1599202 0.0762802 debye
polarizability: 334.694573|-6.2143021|237.8333678|29.2075523|-24.2538261|139.2143013 unknown
InChI: InChI=1S/C19H23NO/c1-21-18-9-8-17-7-3-6-16(19(17)14-18)5-2-4-15-10-12-20-13-11-15/h2-3,5-9,14-15,20H,4,10-13H2,1H3
charge 0 multiplicity 1
44 atoms
O  -4.064397 2.644303 -0.773833
N  6.364238 0.21049 -1.096779
C  3.986832 0.47548 0.584491
C  3.944771 -0.202028 -0.808279
C  5.157232 1.490131 0.638024
C  5.311036 -0.827371 -1.160536
C  6.491643 0.82081 0.244529
C  2.634604 1.156018 0.94885
C  1.494306 0.178364 1.118441
C  0.320464 0.213215 0.423568
C  -0.788049 -0.760484 0.541646
C  -2.156615 -0.373108 0.233416
C  -3.208832 -1.372553 0.316749
C  -0.536667 -2.092521 0.922231
C  -2.515874 0.960514 -0.132119
C  -2.893334 -2.71137 0.716679
C  -1.57709 -3.062089 1.021635
C  -4.552644 -0.99167 0.004524
C  -3.842887 1.299084 -0.428614
C  -4.879825 0.31306 -0.367403
C  -5.436635 3.057817 -1.073281
H  4.188408 -0.315218 1.342923
H  3.694163 0.558396 -1.574506
H  3.155117 -0.977094 -0.834793
H  5.242771 1.923664 1.654646
H  4.955381 2.319683 -0.068126
H  5.504637 -1.676366 -0.453021
H  5.286185 -1.245965 -2.183733
H  7.302303 1.572617 0.217475
H  6.755893 0.068595 1.034129
H  2.781794 1.715395 1.898391
H  2.381501 1.904699 0.171539
H  7.264907 -0.117609 -1.46765
H  1.647343 -0.604469 1.878846
H  0.185267 1.033925 -0.295277
H  0.495989 -2.403412 1.115446
H  -1.769054 1.757533 -0.171206
H  -3.698639 -3.453403 0.774221
H  -1.331531 -4.087682 1.318095
H  -5.340182 -1.752458 0.064977
H  -5.916936 0.571252 -0.600825
H  -5.366947 4.131535 -1.302004
H  -6.10516 2.906458 -0.203294
H  -5.841385 2.517435 -1.951294
