program: Gaussian 09
title: 000292182
version: EM64L-G09RevD.01
frameworkgroup: C1[X(C12H9NO2S)]
method: RPBEPBE
basis: SDD
operation: Freq
keyword: #p
keyword: freq=noraman
keyword: PBEPBE/SDD
title: #p freq=noraman PBEPBE/SDD
converged: YES YES NO NO
title: Mulliken charges:
elementType: S O O N C C C C C C C C C C C C H H H H H H H H H
charge: 0.285859 -0.264991 -0.286165 -0.458548 0.505620 0.244044 0.135518 -0.400312 -0.171011 -0.329978 -0.325050 -0.517284 -0.227976 -0.251109 -0.224776 -0.094960 0.377153 0.319138 0.275325 0.240984 0.273424 0.233775 0.234682 0.234457 0.192179
chargesum: 0.00000
title: Mulliken charges with hydrogens summed into heavy atoms:
elementType: S O O N C C C C C C C C C C C C
charge: 0.285859 -0.264991 -0.286165 -0.081395 0.505620 0.244044 0.135518 -0.400312 0.148128 -0.054653 -0.084067 -0.243860 0.005799 -0.016427 0.009681 0.097219
polarizability: 2.72740043e+02 1.91453212e+00 1.81096755e+02 -1.59416214e-01 1.02012799e-01 5.89848518e+01
1716.lowfreq: -6.6469 0.0009 0.0015 0.0016 2.9269 9.9384 27.5678 42.9034 76.4528
frequency: 27.5236 42.8939 76.4374 95.7817 151.0939 174.9449 196.1925 214.5175 248.0168 296.1026 333.6311 346.4741 398.6670 413.1672 448.8412 456.5373 462.0845 554.9517 613.2399 633.9487 675.8789 688.1701 693.8242 699.0687 767.0736 767.9634 798.7194 799.0052 848.9948 869.9414 908.4882 931.3928 944.8607 951.8269 969.7115 988.4021 992.3774 1011.3218 1027.9792 1079.4537 1087.1630 1105.1662 1174.3253 1192.0244 1205.2465 1253.1613 1260.2169 1329.0209 1352.1937 1386.8977 1415.5367 1433.9944 1440.7181 1472.2911 1491.1940 1546.1295 1561.1798 1583.4470 1611.5862 1614.5889 2962.3761 3123.2249 3133.7488 3147.3089 3160.1779 3170.8569 3217.5628 3231.5375 3239.4133
redmass: 4.1089 7.7496 6.5797 7.1122 6.2230 5.6238 7.3176 7.5740 3.6721 7.0279 3.9514 8.9388 2.7762 11.5979 4.0358 4.0378 7.7332 9.9834 6.4422 7.5295 3.0634 3.9844 6.6890 1.5310 1.4305 6.9685 2.7072 4.4653 1.2683 5.2467 1.2415 1.3126 1.5621 1.3997 6.3177 6.1625 1.3736 1.3367 2.3081 1.2962 1.5272 2.6065 1.0635 2.1243 1.2300 2.4326 2.1677 1.3612 1.5607 7.8902 3.8989 2.8529 4.2360 3.6629 2.7142 4.9125 6.6294 3.3061 5.8178 3.2065 1.0880 1.0886 1.0873 1.0919 1.0956 1.1009 1.0897 1.0811 1.1028
irintensity: 0.2462 3.0105 3.0320 1.8829 0.4848 0.2075 11.6197 1.8650 3.1478 5.5047 12.0613 1.1696 0.0066 3.8620 5.9714 0.0770 5.3019 24.8807 0.6277 11.5349 9.7831 0.4384 16.2864 94.3744 56.0341 27.1848 16.9755 10.3671 16.4155 23.0667 66.2490 13.1751 2.9844 32.6786 5.7566 1.9477 0.4844 0.8687 11.9701 30.3201 23.3421 5.1914 4.1458 83.2461 10.5730 142.6835 214.3303 5.3167 80.7326 2.7650 89.1783 78.5167 291.6449 3.3047 13.0245 264.8839 384.2001 215.9972 11.7627 103.7756 90.9897 2.7152 1.5649 15.2362 13.0583 28.7443 10.1742 69.1314 5.8735
temp: 298.150 k
press: 1.00000 atm
elementType: 16 8 8 7 6 6 6 6 6 6 6 6 6 6 6 6 1 1 1 1 1 1 1 1 1
symmnumber: 1
zpe: 475526.3 jmol-1
zpe.correction: 0.181118 hartree
zpe.thermalcorrener: 0.194616 hartree
zpe.thermalcorrenthalpy: 0.195560 hartree
zpe.thermalcorrgfe: 0.139362 hartree
zpe.sumelectzpe: -1064.830442 hartree
zpe.sumelectthermal: -1064.816944 hartree
zpe.sumelectthermalent: -1064.816000 hartree
zpe.sumelectthermalfe: -1064.872198 hartree
dipole: -0.4744 0.1196 0.0202
dipole: 0.4897
quadrupole: -74.5163 -100.8703 -104.6692
quadrupole: 5.3227 -0.0383 0.0809
quadrupole: 18.8356 -7.5184 -11.3173 5.3227 -0.0383 0.0809
hfenergy: -1065.0115599 hartree
pointgroup: C01 [X(C12H9N1O2S1)]
dipole: 0.187298 -0.0424419 0.0151618 debye
dipolederiv: -0.4563687 0.1925954 -0.0283154 0.2124223 -0.0471879 0.0212536 -0.0302212 0.0206568 0.149597 -0.8116052 -0.1328084 0.0036084 0.2850985 -0.9626253 0.0580279 -0.0305714 0.0505869 -0.353044 -0.6120355 -0.6890414 0.0515535 -0.0380602 -0.8601885 0.0415552 -0.0017659 0.0281967 -0.3521747 -2.2900278 0.5663223 -0.0860351 0.5057193 -0.4940856 0.0294261 -0.0786982 0.0309794 -0.2642011 1.3664448 -0.3829997 0.0561502 0.6935824 0.3306979 -0.0001448 -0.0343423 -0.0220098 0.1614936 -0.5965196 -0.1326965 0.0014261 -0.2295458 -0.1030427 0.002912 0.0089125 0.0046993 -0.021029 2.4776764 -0.1069524 0.0476868 -0.7503618 1.2147297 -0.0972793 0.0997768 -0.0862605 0.2420028 0.1893055 0.1922461 -0.0070815 0.4102436 -1.1442206 0.0842776 -0.0250919 0.0817843 -0.2385349 -0.7070596 -0.0952235 -0.0035205 -0.3756232 -0.1384051 -0.0070118 0.0187454 -0.0013695 -0.1328825 0.0604195 0.1164225 -0.0078298 -0.1295088 0.0423716 -0.0165371 0.0134884 -0.0110283 -0.1035406 0.0391363 -0.0276545 0.0067775 0.1237017 -0.0248515 -0.0081711 -0.0054989 -0.0102543 -0.1292868 0.4737246 -0.1345236 0.0264534 -0.4201341 0.122624 -0.0400633 0.0501105 -0.0343717 -0.2490803 0.0094784 -0.1710761 0.0195 -0.2375971 -0.0373708 -0.0157981 0.025864 -0.0147748 -0.1537527 -0.2462892 0.0355621 -0.0053072 0.1172435 0.1456628 -0.0262587 -0.013274 -0.0275205 -0.1468603 0.0906198 0.0583854 -0.0009079 0.0303434 0.0162205 -0.0140323 0.0019625 -0.0135024 -0.1368068 0.5283683 0.4245491 -0.0261706 -0.1278482 1.5265445 -0.1194255 0.0193544 -0.1093453 0.1422425 0.3314634 -0.0006989 0.0008249 -0.1796843 0.2449631 0.0001012 0.0151942 0.0034437 0.2891133 0.1801559 0.0740179 -0.0069506 0.0048257 0.1085552 0.0080441 -0.001007 0.0095804 0.2040667 0.1687202 -0.0475131 0.0047319 0.000574 -0.0007924 0.0149722 0.0011524 0.0135255 0.1535687 0.0176267 0.0821381 -0.0107306 0.1017947 0.0468256 0.0123254 -0.0133087 0.0115234 0.1507786 0.0739742 -0.0189178 -0.0010756 -0.0429 0.0402924 0.0124188 0.0009565 0.0130573 0.1989712 -0.0665369 0.0909156 -0.0130912 0.1096941 0.0103958 0.0162579 -0.0147173 0.015893 0.1563823 0.0642244 -0.0201194 0.0000543 -0.0645449 -0.0974939 0.0235228 0.0041035 0.0243608 0.1576161 -0.1095121 -0.0691339 0.0012705 -0.074931 0.0701022 0.0069993 0.0018525 0.007014 0.1579296 -0.1753839 0.1962048 -0.0230217 0.0754961 -0.009721 0.0126276 -0.0129768 0.0151358 0.1174314 unknown
polarizability: 272.5573604|3.9601267|180.2759329|3.8093208|-10.579801|59.9883567 unknown
InChI: InChI=1S/C12H9NO2S/c14-8-11-10(6-7-16-11)13-12(15)9-4-2-1-3-5-9/h1-8,13H
charge 0 multiplicity 1
25 atoms
S  4.559513 -0.026149 0.095323
O  -0.344876 2.173417 -0.192725
O  1.379667 -2.55925 0.241598
N  0.558153 0.024039 0.005816
C  1.912875 0.347231 0.007221
C  -1.887087 0.297843 -0.058018
C  -0.518103 0.919776 -0.08825
C  2.873671 -0.696054 0.114798
C  2.502234 1.660557 -0.08928
C  -2.991369 1.184321 -0.163718
C  -2.127301 -1.097984 0.070771
C  3.887165 1.62302 -0.055948
C  -4.31058 0.691185 -0.142891
C  -3.450547 -1.588587 0.091592
C  -4.544607 -0.698741 -0.015099
C  2.582736 -2.099847 0.22891
H  0.400916 -1.000096 0.0875
H  1.904495 2.566864 -0.177191
H  -2.781961 2.254637 -0.260258
H  -1.309347 -1.822806 0.157905
H  4.577018 2.463933 -0.111285
H  -5.154135 1.384914 -0.225494
H  -3.626401 -2.66494 0.19163
H  -5.56957 -1.085511 0.001408
H  3.441541 -2.800771 0.307783
