program: Gaussian 09
title: 000292237
version: EM64L-G09RevD.01
frameworkgroup: C1[X(C26H24O4)]
method: RPBEPBE
basis: SDD
operation: Freq
keyword: #pfreq=noraman
keyword: PBEPBE/SDD
title: #p freq=noraman PBEPBE/SDD
converged: YES YES NO NO
title: Mulliken charges:
elementType: O O O O C C C C C C C C C C C C C C C C C C C C C C C C C C H H H H H H H H H H H H H H H H H H H H H H H H
charge: -0.190752 -0.215973 -0.260793 -0.257135 -0.419169 -0.417153 -0.506681 -0.508557 0.141615 0.161041 -0.176942 0.010766 0.360492 -0.488851 -0.439015 0.285631 0.230257 0.288915 -0.363430 -0.358700 -0.403432 -0.395883 -0.355373 -0.364420 -0.351509 -0.366192 0.315490 0.315007 -0.538249 -0.536974 0.212161 0.204935 0.211945 0.206724 0.232440 0.254496 0.233199 0.260567 0.283402 0.277010 0.259551 0.262188 0.264822 0.249885 0.253837 0.253373 0.244174 0.243090 0.230069 0.248058 0.221348 0.223933 0.226239 0.248525
chargesum: 0.00000
title: Mulliken charges with hydrogens summed into heavy atoms:
elementType: O O O O C C C C C C C C C C C C C C C C C C C C C C C C C C
charge: -0.190752 -0.215973 -0.260793 -0.257135 -0.002074 0.001516 -0.019745 -0.014792 0.141615 0.161041 -0.176942 0.010766 0.360492 -0.205449 -0.162005 0.285631 0.230257 0.288915 -0.103879 -0.096512 -0.138610 -0.145997 -0.101535 -0.111047 -0.107335 -0.123103 0.315490 0.315007 0.161226 0.161723
polarizability: 5.60540156e+02 4.48831947e+01 3.91963277e+02 8.36665953e+00 6.57172351e+00 1.83401977e+02
1716.lowfreq: -0.0009 -0.0005 -0.0002 0.7751 3.3321 5.2455 19.2513 24.0431 28.4336
frequency: 19.0929 24.0116 28.2839 34.1159 37.1303 58.8962 68.7718 91.2327 94.5394 99.3807 102.8981 126.8819 141.0278 158.7556 173.1508 180.1196 191.3559 215.5188 232.9904 235.5120 254.6863 262.5698 274.9191 285.2541 311.6846 327.9215 339.5912 363.5043 409.9760 412.7162 417.2535 427.0004 434.0320 445.2202 456.1924 482.3599 506.4596 510.0473 514.0893 520.0953 543.5395 575.0783 608.1388 617.1350 631.0486 634.3805 654.3620 676.3855 696.3994 710.3632 738.4359 741.5610 767.5791 783.8229 788.3901 813.4063 819.8709 828.2370 837.5234 839.1287 842.7150 854.0759 887.8623 902.7900 908.2742 926.7603 941.6402 952.3545 957.8366 969.2167 973.2125 977.5360 983.0056 984.0238 999.6219 1003.5985 1046.8226 1080.2118 1088.0028 1110.6397 1110.8897 1113.5620 1114.7547 1121.7135 1122.8301 1148.6783 1157.0389 1158.1568 1173.9257 1178.5742 1183.8533 1191.4834 1232.3432 1235.8826 1236.8312 1242.1075 1256.1345 1269.6457 1294.5936 1301.6684 1307.0647 1317.3406 1332.8812 1341.3510 1350.6063 1351.7060 1358.5430 1375.4490 1396.9084 1421.1658 1428.9838 1436.3231 1438.2650 1440.8631 1449.8511 1467.5252 1468.7201 1471.3568 1471.8744 1472.2120 1474.7487 1494.5919 1498.2543 1502.4222 1526.6459 1561.1643 1563.2174 1566.2996 1584.7308 1613.3835 1619.5125 1642.3205 2964.7750 2965.0486 2969.4234 2972.4625 2981.2222 2983.4962 3036.7001 3039.3192 3044.5282 3053.0704 3055.5193 3055.6514 3113.6567 3129.3850 3129.8546 3139.6225 3139.7659 3141.2239 3148.0797 3164.7823 3166.1933 3171.0628 3171.6646 3175.3636
redmass: 5.6774 5.4558 4.8652 4.0748 4.4969 4.7462 4.7357 4.0307 3.3350 2.7082 3.8280 5.1066 5.0011 4.2029 4.6448 3.9323 3.7125 2.1026 1.3464 1.6260 3.3318 3.8988 3.6057 1.9579 4.4540 4.9739 5.2578 6.2162 4.8260 3.0065 3.0512 3.7317 4.3991 4.7181 8.1721 4.0105 3.6469 3.0753 4.2125 2.7637 3.3276 3.9127 4.7749 5.4765 6.8950 5.3828 4.3935 5.4997 4.5407 3.9894 4.1843 4.1436 5.2796 2.4938 4.8144 1.3182 1.3251 2.1413 1.6816 2.1446 1.9724 2.6200 1.5349 1.8312 2.6369 1.6976 2.3742 1.4074 1.5844 1.3621 1.3435 2.5427 8.4659 8.7188 2.7639 2.5114 3.4327 2.1236 2.6740 1.2750 1.5354 1.2684 1.4161 1.3981 1.1669 2.7949 1.3280 1.3525 1.6024 1.2749 1.3307 2.3469 1.8461 1.4032 2.6488 2.5873 1.9729 1.5611 2.2909 1.5849 1.3878 2.3806 1.4411 1.4854 3.4069 1.6642 4.7464 2.9837 2.2980 3.8894 3.4062 1.2058 1.2087 1.1160 1.0781 1.0501 1.0495 1.0796 1.0882 1.0754 1.0905 3.3956 3.9705 2.6089 10.1726 6.7677 7.0635 7.3287 6.5858 6.1915 6.4700 7.4673 1.0328 1.0328 1.0681 1.0679 1.0648 1.0601 1.0911 1.0910 1.0986 1.1032 1.1041 1.1042 1.0863 1.0997 1.0996 1.0888 1.0881 1.0888 1.0879 1.0950 1.0948 1.0963 1.0967 1.0913
irintensity: 0.2206 0.6751 0.4173 1.9161 1.1857 2.2499 1.7109 2.2390 0.9370 2.7627 2.0481 4.7141 3.5038 2.7158 1.1210 3.4261 2.8474 2.7994 0.8306 0.3073 1.8030 1.6650 6.4593 4.8963 6.5723 2.4497 1.0649 39.6524 3.7277 2.8561 2.4659 0.0895 5.3963 0.4009 10.6316 13.2251 20.1080 9.4718 18.2023 7.9977 16.6851 35.2490 8.8888 2.9172 0.5586 0.3044 5.6805 0.5143 4.9321 2.0779 0.6556 3.8362 5.5855 7.8071 6.1418 12.7336 16.1336 18.1164 83.3267 2.1530 17.5228 34.6346 5.2554 7.9151 9.2590 46.1613 17.8096 8.1202 5.2480 0.9362 2.2484 24.4114 52.4290 59.0993 7.7190 15.9122 25.9655 9.4070 1.8735 0.1175 6.0999 0.8214 8.2707 7.3670 2.5173 61.1021 11.8273 16.0856 46.3149 256.0190 88.1788 117.1952 22.4669 47.2334 194.5128 178.5833 72.5057 9.0261 216.5548 158.8057 74.8152 142.0765 2.8649 3.1638 11.3206 8.6308 17.4316 66.6068 61.4745 4.0478 2.3254 29.6170 3.6664 11.9752 22.6491 14.3620 15.4277 105.6092 17.5127 45.3133 10.7500 253.9242 47.9123 55.1693 436.3360 172.1125 196.3448 317.4304 34.7742 290.6684 31.7960 9.2999 109.3731 55.8358 7.8269 7.7475 47.5346 41.7351 18.5810 12.2074 72.2264 56.0723 35.7823 43.9132 23.6592 27.7032 29.6835 2.9068 2.2710 9.3533 3.9934 16.4216 10.2505 3.9645 13.2482 4.6001
temp: 298.150 k
press: 1.00000 atm
elementType: 8 8 8 8 6 6 6 6 6 6 6 6 6 6 6 6 6 6 6 6 6 6 6 6 6 6 6 6 6 6 1 1 1 1 1 1 1 1 1 1 1 1 1 1 1 1 1 1 1 1 1 1 1 1
symmnumber: 1
zpe: 1127283.3 jmol-1
zpe.correction: 0.429360 hartree
zpe.thermalcorrener: 0.456546 hartree
zpe.thermalcorrenthalpy: 0.457491 hartree
zpe.thermalcorrgfe: 0.369614 hartree
zpe.sumelectzpe: -1303.891612 hartree
zpe.sumelectthermal: -1303.864425 hartree
zpe.sumelectthermalent: -1303.863481 hartree
zpe.sumelectthermalfe: -1303.951357 hartree
dipole: -1.9555 -0.7952 -1.0406
dipole: 2.3536
quadrupole: -155.8679 -151.6868 -175.3328
quadrupole: 9.1821 -11.5413 -19.8209
quadrupole: 5.0946 9.2757 -14.3703 9.1821 -11.5413 -19.8209
hfenergy: -1304.3209714 hartree
pointgroup: C01 [X(C26H24O4)]
dipole: 0.8057555 -0.2816132 0.3589786 debye
polarizability: 567.3482431|-29.014446|384.2252334|-5.326121|15.8178638|184.3319334 unknown
InChI: InChI=1S/C26H24O4/c1-29-20-11-7-17(8-12-20)24(18-9-13-21(30-2)14-10-18)15-19-16-25(27)22-5-3-4-6-23(22)26(19)28/h7-16H,3-6H2,1-2H3
charge 0 multiplicity 1
54 atoms
O  -1.432931 -3.056386 0.622633
O  -4.019193 1.457953 -0.982953
O  0.505633 5.737538 0.44245
O  6.683605 -1.723386 -0.278434
C  -5.75762 -3.073702 0.65229
C  -6.332106 -2.185835 -0.474719
C  -4.237379 -3.273007 0.470664
C  -5.681275 -0.786609 -0.449593
C  -3.515636 -1.978863 0.137883
C  -4.177122 -0.843949 -0.276014
C  -2.030125 -1.986186 0.267934
C  -3.403569 0.403594 -0.586015
C  -1.238173 -0.719483 -0.020529
C  -1.947183 0.399206 -0.432565
C  0.205008 -0.875364 0.101945
C  1.237192 0.05752 0.061604
C  1.026142 1.530906 0.178925
C  2.639446 -0.422037 -0.059581
C  1.620186 2.437325 -0.747135
C  3.728076 0.333497 0.477046
C  0.257136 2.075415 1.23992
C  2.953545 -1.651871 -0.706804
C  1.423387 3.823814 -0.638722
C  5.050301 -0.12526 0.393748
C  0.061411 3.464674 1.374069
C  4.276189 -2.124391 -0.804134
C  0.639631 4.345284 0.422461
C  5.333703 -1.359871 -0.245769
C  -0.332102 6.327302 1.492388
C  7.034631 -2.997128 -0.916051
H  -6.262764 -4.057382 0.669581
H  -5.955356 -2.591063 1.630463
H  -7.429253 -2.089547 -0.374373
H  -6.138004 -2.669484 -1.453014
H  -4.041573 -4.003974 -0.341056
H  -3.777924 -3.72003 1.371448
H  -6.10449 -0.182225 0.380055
H  -5.911284 -0.207864 -1.363088
H  -1.448522 1.341109 -0.674139
H  0.493108 -1.926535 0.232058
H  2.226363 2.043151 -1.5700
H  3.523295 1.28124 0.984903
H  -0.191157 1.396696 1.973617
H  2.150378 -2.235488 -1.169191
H  1.86073 4.520624 -1.359843
H  5.88028 0.446555 0.819283
H  -0.533106 3.845029 2.209872
H  4.472369 -3.068158 -1.321434
H  -1.370387 5.948378 1.435193
H  -0.318795 7.408709 1.294097
H  0.084686 6.126932 2.4984
H  6.759924 -2.997445 -1.988427
H  6.546557 -3.849107 -0.405045
H  8.126318 -3.076916 -0.812298
