program: Gaussian 09
title: 000292174
version: EM64L-G09RevD.01
frameworkgroup: C1[X(C13H9NOS)]
method: RPBEPBE
basis: SDD
operation: Freq
keyword: #p
keyword: freq=noraman
keyword: PBEPBE/SDD
title: #p freq=noraman PBEPBE/SDD
converged: NO YES NO NO
title: Mulliken charges:
elementType: S O N C C C C C C C C C C C C C H H H H H H H H H
charge: 0.182587 -0.238633 -0.373552 0.213591 -0.208475 -0.046125 0.110908 -0.294289 -0.324254 -0.215272 0.292901 -0.370976 -0.370990 -0.213903 -0.213892 -0.238099 0.333926 0.261584 0.277435 0.260844 0.243975 0.243943 0.228390 0.228389 0.229987
chargesum: 0.00000
title: Mulliken charges with hydrogens summed into heavy atoms:
elementType: S O N C C C C C C C C C C C C C
charge: 0.182587 -0.238633 -0.039627 0.213591 -0.208475 -0.046125 0.110908 -0.032704 -0.046819 0.045572 0.292901 -0.127001 -0.127047 0.014487 0.014497 -0.008112
polarizability: 2.62885971e+02 1.46404962e+00 1.44669740e+02 -3.57725964e-02 -3.88698319e-02 1.04922714e+02
1716.lowfreq: -59.4044 -0.0010 0.0019 0.0020 2.6118 5.6473 10.6717 45.3086 50.7138
frequency: -59.3966 45.1983 50.7064 95.4599 164.2099 176.8891 223.2188 237.2245 274.3588 338.3938 394.0406 404.5943 448.4815 466.1421 494.2850 549.3169 554.2433 585.8702 612.6630 614.5660 619.1793 637.2728 701.8808 735.7153 751.3749 757.6191 757.7325 851.0165 858.7002 861.0373 870.7767 893.7142 922.4089 976.4234 986.4546 990.7981 996.4433 1027.5122 1044.6593 1069.3624 1077.7791 1145.0214 1173.0651 1187.6269 1216.9405 1224.9996 1263.0635 1309.2729 1324.3050 1366.6852 1422.6174 1424.4966 1426.8693 1465.6498 1476.8068 1510.1168 1581.2594 1595.2371 1607.9169 1652.5827 3073.6040 3124.4729 3131.8576 3143.3632 3152.6437 3166.0002 3220.6703 3242.8488 3595.7233
redmass: 4.1273 7.3449 6.3873 5.6642 5.9319 5.7433 6.6320 6.4068 6.6099 7.3526 2.8267 9.3969 4.2985 2.7899 14.8045 6.5311 7.4955 2.7267 4.7694 5.3293 2.7763 1.8605 1.9130 3.4480 1.8820 5.7575 1.5197 1.2949 1.3452 3.7280 1.5832 5.5723 1.5510 1.3840 6.0789 2.7132 1.4293 2.1731 2.9613 2.1357 1.6073 1.5991 1.0525 1.1193 1.9817 1.9020 1.7987 1.3837 3.0329 6.2528 3.8506 5.0844 2.2248 6.2829 2.3235 4.1335 5.9173 10.8790 6.3850 9.8784 1.0868 1.0845 1.0878 1.0927 1.0970 1.1019 1.0922 1.1054 1.0816
irintensity: 0.0632 2.6253 0.9448 2.5836 0.4786 1.8415 0.6427 6.3462 10.3206 1.8431 0.1543 8.7593 3.8358 1.3648 5.7769 15.1305 0.7647 40.2633 26.3853 0.0116 8.8307 78.9663 52.4651 0.9471 29.2743 3.6217 81.5697 0.2731 2.8857 5.8975 14.0091 21.8518 1.2337 0.1022 8.5220 12.3544 3.2947 9.4056 87.9805 74.4093 10.5447 1.0656 0.0230 3.0850 2.0946 34.8733 1.4501 0.0757 18.3135 0.0004 50.7775 146.1214 6.7773 49.2951 20.5057 1.0698 1.7190 287.8072 38.7967 27.4962 2.2075 0.7751 1.0131 17.9936 34.4868 23.3843 0.6144 2.2074 97.5374
temp: 298.150 k
press: 1.00000 atm
elementType: 16 8 7 6 6 6 6 6 6 6 6 6 6 6 6 6 1 1 1 1 1 1 1 1 1
symmnumber: 1
zpe: 480560.5 jmol-1
zpe.correction: 0.183036 hartree
zpe.thermalcorrener: 0.195165 hartree
zpe.thermalcorrenthalpy: 0.196109 hartree
zpe.thermalcorrgfe: 0.143625 hartree
zpe.sumelectzpe: -1027.704333 hartree
zpe.sumelectthermal: -1027.692203 hartree
zpe.sumelectthermalent: -1027.691259 hartree
zpe.sumelectthermalfe: -1027.743743 hartree
dipole: -1.8116 -1.9213 -0.0018
dipole: 2.6407
quadrupole: -66.3905 -106.4861 -96.8971
quadrupole: 0.9018 -0.0085 -0.0288
quadrupole: 23.5341 -16.5615 -6.9726 0.9018 -0.0085 -0.0288
hfenergy: -1027.8873684 hartree
pointgroup: C01 [X(C13H9N1O1S1)]
dipole: 0.713342 -0.7553156 -0.0000743 debye
dipolederiv: -0.3421915 -0.0211116 0.0000567 0.1924779 -0.1983901 0.0000233 0.0001838 -0.0000079 0.0599179 -0.6165974 -0.1162645 0.0000393 -0.1503555 -1.2596428 0.0001413 -0.0000029 0.0002697 -0.3213591 -0.1426393 -0.3041882 0.0000703 -0.5048051 -0.4364702 0.0001574 0.0001233 0.000161 -0.210338 -0.329927 0.6436359 -0.0001215 0.5110666 -0.6898389 0.000052 -0.0001908 -0.0000524 -0.0208065 0.9994126 0.0286547 -0.0001532 -0.3483891 0.267001 0.0000113 -0.0001938 -0.0000262 -0.0914224 -0.7929224 -0.3317905 0.0000763 -0.5110602 0.4080899 -0.0001273 0.000662 0.0000508 -0.1102123 1.3637748 -0.2721813 -0.0000302 0.0637453 1.3486033 -0.000161 0.0002295 -0.0001884 0.1891822 -0.7622768 0.0765105 0.0000574 -0.1226087 0.0459239 -0.0000097 0.0000893 -0.0000604 -0.2174455 0.3531539 0.0646814 0.0001042 0.167118 -0.030005 -0.0000986 -0.0003623 -0.0001697 -0.1457866 0.011901 0.1177693 -0.0000476 0.6644217 0.2114562 -0.0001925 -0.0001561 -0.0001055 -0.1446968 0.2508244 0.03157 -0.0001348 0.202711 -0.0482057 0.0000956 -0.0001457 0.0001277 0.0085431 -0.1901881 0.0517452 -0.0697253 -0.0432073 -0.1045651 -0.0227142 0.0692459 -0.033324 0.056911 -0.1892789 0.0519783 0.0693614 -0.0448853 -0.1045921 0.0235095 -0.069547 0.0340626 0.0570836 -0.0497318 0.062307 0.0707904 0.0513408 -0.1106664 0.0403691 0.0272662 0.0431632 0.080867 -0.0502249 0.0621213 -0.0712046 0.0514704 -0.1110556 -0.0394826 -0.0279816 -0.0422658 0.0809048 0.0384066 0.1153907 -0.0000925 0.0917854 -0.1067093 0.0001972 0.0002367 0.0002307 -0.0710157 0.2516315 0.0523411 0.0000094 0.0505131 0.2144559 0.0000078 0.0000001 -0.0000041 0.3444302 0.0991395 0.006568 0.0000054 0.0424109 -0.0209004 0.0000346 -0.0000107 0.0000304 0.2033985 0.0140616 -0.0357934 0.0000425 -0.0390565 0.0119368 -0.0000198 -0.0004601 -0.0001217 0.1605153 -0.0363365 0.0147007 0.0000353 -0.0074823 0.1081482 0.000026 0.0000639 0.0000129 0.2118786 0.0927639 -0.0518064 0.0851846 -0.0326461 0.1160281 0.0337262 0.0862984 0.0262836 -0.0347725 0.0931648 -0.0521111 -0.0848516 -0.0329185 0.1158355 -0.0344835 -0.0858649 -0.0270062 -0.0348626 0.0146827 -0.0429768 -0.0773691 -0.0627625 0.1331373 -0.039809 -0.0998312 -0.0380531 -0.0693571 0.0142515 -0.042762 0.0778307 -0.0623121 0.1334895 0.0388961 0.1002611 0.0371406 -0.0693692 -0.0948541 -0.1089884 0.0000666 -0.1265719 0.106936 -0.0001494 0.0000868 -0.0001478 0.0878119 unknown
polarizability: 262.8882584|-1.3681229|144.6673373|-0.0533784|0.0756935|104.9228286 unknown
InChI: InChI=1S/C13H9NOS/c15-13-11(8-9-4-2-1-3-5-9)16-10-6-7-14-12(10)13/h1-8,14H
charge 0 multiplicity 1
25 atoms
S  0.567109 -1.333081 0.000232
O  1.747111 2.545927 -0.000504
N  4.120661 0.364226 -0.000552
C  2.727644 0.297472 -0.000213
C  2.365315 -1.06342 -0.000003
C  0.342832 0.511089 0.000005
C  1.663183 1.27554 -0.000154
C  3.549997 -1.84973 -0.000013
C  -0.866458 1.130587 0.000032
C  4.625899 -0.929115 -0.000329
C  -2.199187 0.458685 0.000085
C  -2.845531 0.14153 -1.224166
C  -2.848077 0.146662 1.224307
C  -4.116355 -0.476723 -1.222372
C  -4.118876 -0.471639 1.222451
C  -4.757382 -0.783997 0.000022
H  4.659606 1.229364 -0.000807
H  3.644695 -2.933216 0.000165
H  -0.828614 2.231985 -0.000089
H  5.697332 -1.1227 -0.000452
H  -2.349478 0.377011 -2.17233
H  -2.353991 0.386084 2.172512
H  -4.602832 -0.719436 -2.173789
H  -4.607309 -0.710417 2.173861
H  -5.743197 -1.262388 0.000003
