program: Gaussian 09
title: 000292172
version: EM64L-G09RevD.01
frameworkgroup: C1[X(C11H13NOS2)]
method: RPBEPBE
basis: SDD
operation: Freq
keyword: #p
keyword: freq=noraman
keyword: PBEPBE/SDD
title: #p freq=noraman PBEPBE/SDD
converged: YES YES NO NO
title: Mulliken charges:
elementType: S S O N C C C C C C C C C C C H H H H H H H H H H H H H
charge: 0.176193 0.229340 -0.260246 -0.373744 -0.359230 -0.331640 -0.655333 0.205266 -0.201658 0.045259 0.093136 -0.681293 -0.293502 -0.536130 -0.218700 0.216946 0.211372 0.195800 0.217397 0.267270 0.278732 0.331304 0.221927 0.206806 0.212499 0.259482 0.283868 0.258880
chargesum: 0.00000
title: Mulliken charges with hydrogens summed into heavy atoms:
elementType: S S O N C C C C C C C C C C C
charge: 0.176193 0.229340 -0.260246 -0.042440 0.069088 0.081557 -0.109331 0.205266 -0.201658 0.045259 0.093136 -0.040060 -0.034021 -0.252262 0.040179
polarizability: 3.14827394e+02 1.35142060e+01 1.57863881e+02 -8.48240320e+00 3.58045707e+00 8.21157372e+01
1716.lowfreq: -3.6183 -0.0022 -0.0017 0.0015 3.8096 5.3786 17.5619 31.1687 46.8660
frequency: 16.7995 30.9311 46.6938 64.7055 79.9467 104.8838 159.3554 166.8884 201.7237 206.8586 230.6247 236.0541 250.9433 271.2293 312.3345 411.5969 427.5809 466.2175 500.5316 549.0494 573.2115 584.5242 615.4884 625.2964 634.7282 726.2829 729.2607 743.0549 750.2236 809.9547 836.0845 853.8008 861.2587 876.5329 893.9915 922.2962 986.7378 1018.2024 1055.7381 1065.5121 1066.8851 1074.5082 1114.4489 1147.3927 1195.0106 1224.2443 1225.8993 1242.4492 1281.9594 1297.9592 1311.4383 1321.6185 1361.2723 1391.4797 1419.3229 1424.7468 1446.8722 1456.8221 1467.7909 1473.4920 1478.3329 1486.1893 1507.8838 1572.4865 1606.5841 2969.3464 2975.1929 2979.3787 3011.8351 3021.1768 3040.7749 3072.0262 3077.7491 3098.9226 3116.3450 3221.0327 3243.2699 3598.9270
redmass: 4.8020 4.5246 3.5585 6.7530 2.3538 3.1477 6.2828 6.2825 3.3141 2.8854 1.3289 6.4760 2.4956 6.7861 4.9814 10.5800 5.4040 3.0616 14.9330 7.9955 6.7565 2.6320 2.9513 3.9579 1.7245 8.1260 2.8256 1.2058 1.6259 1.6910 1.4278 1.3486 2.9599 1.7627 5.6033 1.3358 3.2299 2.7067 1.9435 1.3000 1.9683 2.9288 2.1071 1.7161 1.4656 1.8820 1.3164 1.2462 1.1850 1.2091 1.2391 2.9719 1.5775 1.2124 3.6745 5.5410 1.0944 1.0764 6.1582 1.0555 1.0429 1.0803 4.2748 10.3604 9.9748 1.0594 1.0371 1.0615 1.0853 1.0702 1.1003 1.1011 1.0992 1.1092 1.0892 1.0920 1.1054 1.0815
irintensity: 0.0984 2.3672 2.3942 1.4714 0.7084 0.4885 1.5530 0.8210 1.9346 0.5248 0.2058 7.8256 0.3301 9.3753 0.3520 6.6056 0.1431 2.8684 9.6886 1.0155 3.5271 42.7615 2.9035 10.9959 83.9480 96.5372 2.1631 9.9198 86.4504 1.4610 16.2392 9.4870 74.4934 4.7362 20.1164 11.0642 18.4800 5.6925 18.2014 13.8732 4.6900 143.7232 9.0873 3.6326 1.8025 42.6749 9.9803 4.3822 19.5643 38.7973 15.5642 31.3951 2.7442 12.0110 9.4472 193.9342 16.2683 7.6181 76.8229 3.9370 13.1501 16.7118 6.5668 311.9582 245.3990 5.8800 46.6204 58.0538 6.5864 10.5194 25.4962 77.3248 42.8128 21.2859 1.3872 0.8131 2.8228 93.0655
temp: 298.150 k
press: 1.00000 atm
elementType: 16 16 8 7 6 6 6 6 6 6 6 6 6 6 6 1 1 1 1 1 1 1 1 1 1 1 1 1
symmnumber: 1
zpe: 567748.8 jmol-1
zpe.correction: 0.216244 hartree
zpe.thermalcorrener: 0.231994 hartree
zpe.thermalcorrenthalpy: 0.232938 hartree
zpe.thermalcorrgfe: 0.170374 hartree
zpe.sumelectzpe: -1351.936354 hartree
zpe.sumelectthermal: -1351.920604 hartree
zpe.sumelectthermalent: -1351.919660 hartree
zpe.sumelectthermalfe: -1351.982224 hartree
dipole: 0.3261 -0.0507 0.0612
dipole: 0.3357
quadrupole: -63.9937 -107.7959 -107.7738
quadrupole: 5.6798 -1.7058 -0.4349
quadrupole: 29.1941 -14.6081 -14.5860 5.6798 -1.7058 -0.4349
hfenergy: -1352.1525979 hartree
pointgroup: C01 [X(C11H13N1O1S2)]
dipole: -0.1283565 -0.0201188 -0.02367 debye
polarizability: 314.6893012|-14.9157048|157.6050653|-7.028092|-6.8666684|82.5126459 unknown
InChI: InChI=1S/C11H13NOS2/c1-2-3-6-14-7-9-11(13)10-8(15-9)4-5-12-10/h4-5,7,12H,2-3,6H2,1H3
charge 0 multiplicity 1
28 atoms
S  1.036068 -1.614007 0.276789
S  -2.206759 -0.357715 0.305296
O  1.639705 2.358203 -0.255499
N  4.292235 0.539195 -0.183444
C  -4.916678 0.444444 0.482451
C  -5.405734 -0.535146 -0.609937
C  -3.519469 1.030661 0.23123
C  2.928199 0.27758 -0.069809
C  2.774212 -1.109171 0.11164
C  0.552865 0.16655 0.082382
C  1.73108 1.093554 -0.101118
C  -6.837683 -1.043649 -0.339858
C  4.060393 -1.716184 0.11158
C  -0.729246 0.628488 0.098349
C  4.985138 -0.660863 -0.074714
H  -4.939945 -0.053922 1.472068
H  -5.625701 1.29573 0.546492
H  -5.367628 -0.028268 -1.5954
H  -4.711535 -1.395447 -0.675992
H  -3.446504 1.493909 -0.767699
H  -3.243117 1.765052 1.006215
H  4.693056 1.465689 -0.322335
H  -7.171027 -1.74061 -1.129759
H  -7.558705 -0.205187 -0.302586
H  -6.893317 -1.578434 0.626897
H  4.313809 -2.767409 0.227537
H  -0.864574 1.711258 -0.031239
H  6.071362 -0.6999 -0.134037
