program: Gaussian 09
title: 000292180
version: EM64L-G09RevD.01
frameworkgroup: C1[X(C15H20N2O2S)]
method: RPBEPBE
basis: SDD
operation: Freq
keyword: #p
keyword: freq=noraman
keyword: PBEPBE/SDD
title: #p freq=noraman PBEPBE/SDD
converged: YES YES NO NO
title: Mulliken charges:
elementType: S O O N N C C C C C C C C C C C C C C C H H H H H H H H H H H H H H H H H H H H
charge: 0.248414 -0.318519 -0.257270 -0.088961 -0.421237 -0.361615 -0.354536 -0.399605 -0.392083 -0.398330 -0.468277 0.481837 -0.529659 -0.016567 0.314493 -0.239245 0.163889 -0.500090 -0.210148 -0.677477 0.178600 0.229869 0.210846 0.169434 0.190871 0.211323 0.206511 0.189756 0.212259 0.188007 0.242519 0.226581 0.338583 0.250668 0.255324 0.228666 0.227017 0.214217 0.226813 0.227122
chargesum: 0.00000
title: Mulliken charges with hydrogens summed into heavy atoms:
elementType: S O O N N C C C C C C C C C C C C C C C
charge: 0.248414 -0.318519 -0.257270 -0.088961 -0.082654 0.046854 0.025744 0.002589 0.004183 0.001936 0.000822 0.481837 -0.529659 -0.016567 0.314493 0.011423 0.163889 -0.244766 0.245536 -0.009325
polarizability: 2.66286403e+02 2.47054412e+01 2.34779229e+02 -8.56477438e+00 9.65907006e+00 1.25777111e+02
1716.lowfreq: -9.4028 -0.0018 -0.0017 0.0006 5.3686 7.5714 27.0725 40.1314 49.7286
frequency: 26.6385 40.1251 49.7057 61.7291 71.0031 76.8351 90.0953 126.9889 132.2237 162.1775 173.6453 234.1827 239.5984 249.5343 282.0558 283.8120 300.2215 305.4133 334.4878 352.0983 389.2944 412.1784 438.7729 447.1507 478.1853 533.0838 536.3965 596.6216 602.8618 610.1906 629.5822 665.6645 672.4548 718.0117 728.0961 731.9713 761.6093 782.9083 800.0807 804.8175 821.4953 852.1793 854.8602 868.5831 877.4866 916.0276 958.1025 985.5250 992.3708 1027.1264 1037.8856 1047.6442 1064.2598 1081.0335 1102.1763 1107.6976 1111.3598 1121.3184 1137.4324 1148.5416 1154.9119 1166.9276 1190.8726 1220.9597 1248.2314 1254.9563 1264.1054 1269.5743 1276.8450 1293.0854 1327.1498 1334.8491 1340.5657 1349.5117 1351.6010 1363.1285 1370.2231 1387.8599 1397.7544 1402.7025 1450.8760 1452.0896 1460.9296 1463.1643 1464.4650 1466.0574 1472.4837 1475.6860 1480.0844 1488.4284 1489.4875 1536.6205 1552.7144 1625.8196 2829.0907 2839.8760 2914.0144 2964.9093 2984.7274 2987.5816 2991.8891 2993.7346 3007.6523 3022.4133 3031.0959 3036.7459 3046.3019 3055.2182 3064.7455 3090.5088 3103.9573 3181.4388 3228.3160 3606.0649
redmass: 3.8467 3.6848 2.9345 3.7518 3.1554 4.3864 7.7460 3.6047 3.4844 4.4299 4.0795 3.3245 1.8821 1.2670 6.2007 5.5854 3.9816 2.1284 5.2177 4.3321 1.7974 4.8721 3.2160 2.9991 4.1418 7.5814 2.1976 4.8217 1.1420 5.8653 4.3145 5.2570 1.8367 6.6116 3.3440 4.3586 3.8186 5.3482 1.1001 1.4854 4.0421 2.0637 1.7350 1.3220 3.2458 2.9970 1.3006 1.9483 2.5426 2.4806 2.8845 2.1519 3.6117 1.3826 1.5766 2.4413 2.1964 2.6708 1.4623 1.8634 1.5914 3.3592 1.3045 1.4211 1.1345 1.3626 1.2359 1.7696 1.3945 1.3714 1.4310 1.5214 1.4237 1.5709 1.4916 1.5578 1.9711 2.0815 1.7688 2.1600 1.1537 1.9831 1.0923 1.3783 1.0408 1.0947 1.2664 1.0595 1.1118 1.5141 1.9265 8.3762 7.4356 11.1489 1.0712 1.0698 1.0666 1.0627 1.0618 1.0614 1.0908 1.0357 1.0581 1.0879 1.0938 1.0898 1.1034 1.1035 1.1065 1.0985 1.1026 1.0918 1.1000 1.0810
irintensity: 0.8813 0.3921 0.0691 1.2283 1.0171 0.2318 0.5609 4.1393 3.0743 1.2583 1.7362 0.7641 0.2144 0.0477 7.1646 10.1215 0.5587 3.6752 1.6876 9.7936 2.3291 1.0743 1.9596 0.2461 3.1205 1.8723 1.2126 0.7444 70.3254 10.7419 6.9821 13.8153 65.1951 20.7777 10.5328 14.3387 15.1108 43.5520 3.7893 0.1198 12.7803 3.8418 8.2140 5.6884 18.1353 42.4659 6.4209 40.4612 49.8601 3.2033 232.6042 7.9977 255.6951 3.8695 24.0634 7.0550 1.1268 6.6894 5.0992 9.1655 6.7046 55.2620 1.4711 229.0243 0.0130 3.7278 1.5587 123.9018 21.4049 4.3570 6.5195 1.0867 1.0404 17.9909 19.3157 1.2861 40.3248 1.1106 72.1292 19.2382 9.2746 27.4038 9.6246 20.7039 12.0134 8.6866 8.5716 5.9546 1.7800 0.7449 32.5259 59.4779 0.8456 456.4561 47.8590 163.9001 35.5441 42.8568 33.5922 32.2083 8.3117 24.6932 26.0633 64.3278 78.4212 15.0445 20.9776 89.7695 8.0880 34.2790 47.7886 5.1284 1.8453 110.2729
temp: 298.150 k
press: 1.00000 atm
elementType: 16 8 8 7 7 6 6 6 6 6 6 6 6 6 6 6 6 6 6 6 1 1 1 1 1 1 1 1 1 1 1 1 1 1 1 1 1 1 1 1
symmnumber: 1
zpe: 860537.4 jmol-1
zpe.correction: 0.327761 hartree
zpe.thermalcorrener: 0.347237 hartree
zpe.thermalcorrenthalpy: 0.348181 hartree
zpe.thermalcorrgfe: 0.278559 hartree
zpe.sumelectzpe: -1240.094427 hartree
zpe.sumelectthermal: -1240.074952 hartree
zpe.sumelectthermalent: -1240.074008 hartree
zpe.sumelectthermalfe: -1240.143630 hartree
dipole: -2.0712 1.5701 0.9306
dipole: 2.7606
quadrupole: -105.0265 -120.5886 -127.4356
quadrupole: -5.1571 -2.4072 1.1129
quadrupole: 12.6570 -2.9050 -9.7520 -5.1571 -2.4072 1.1129
hfenergy: -1240.4221887 hartree
pointgroup: C01 [X(C15H20N2O2S1)]
dipole: -0.8353298 0.5778372 0.384676 debye
polarizability: 265.1557746|25.7026275|234.8856204|-5.8496371|15.1084734|126.8013473 unknown
InChI: InChI=1S/C15H20N2O2S/c1-2-19-15(18)13-11(10-17-7-4-3-5-8-17)14-12(16-13)6-9-20-14/h6,9,16H,2-5,7-8,10H2,1H3
charge 0 multiplicity 1
40 atoms
S  1.751149 2.344464 -0.1562
O  -3.799448 -0.664325 0.125341
O  -2.224657 -2.310491 -0.455796
N  2.140062 -0.930902 -0.270313
N  -1.979799 1.307539 0.202582
C  2.305721 -1.132166 1.193828
C  3.116235 -1.738934 -1.044754
C  3.727151 -0.74227 1.646318
C  4.562907 -1.364873 -0.664037
C  4.792574 -1.536268 0.855553
C  0.740795 -1.152326 -0.713722
C  -0.1424 0.005616 -0.317018
C  0.255451 1.354545 -0.123424
C  -1.549145 -0.001203 -0.106635
C  -0.880593 2.148299 0.196942
C  -0.603749 3.540492 0.41657
C  -2.487019 -1.110116 -0.175109
C  0.749544 3.807133 0.263359
C  -4.859244 -1.711159 0.083576
C  -6.184761 -1.013558 0.374142
H  2.106986 -2.201858 1.46955
H  1.554578 -0.513236 1.717209
H  2.94655 -1.551167 -2.121777
H  2.964107 -2.836934 -0.868271
H  3.829433 -0.925693 2.733367
H  3.866088 0.342309 1.473557
H  4.74163 -0.309756 -0.948155
H  5.268953 -1.993723 -1.240211
H  5.810808 -1.203863 1.133415
H  4.720041 -2.612414 1.118647
H  0.304534 -2.105786 -0.335664
H  0.748098 -1.235316 -1.819425
H  -2.954756 1.533123 0.392143
H  -1.342321 4.303253 0.671074
H  1.255224 4.766581 0.367724
H  -4.842222 -2.1872 -0.913655
H  -4.616366 -2.484151 0.835298
H  -7.007236 -1.751743 0.356271
H  -6.171068 -0.536001 1.369126
H  -6.398241 -0.240021 -0.383621
