program: Gaussian 09
title: 000292179
version: EM64L-G09RevD.01
frameworkgroup: C1[X(C14H16N2O5S)]
method: RPBEPBE
basis: SDD
operation: Freq
keyword: #p
keyword: freq=noraman
keyword: PBEPBE/SDD
title: #p freq=noraman PBEPBE/SDD
converged: YES YES NO NO
title: Mulliken charges:
elementType: S O O O O O N N C C C C C C C C C C C C C C H H H H H H H H H H H H H H H H
charge: 0.229634 -0.281218 -0.255403 -0.304347 -0.202482 -0.221868 -0.446181 -0.379321 0.233077 0.310792 -0.268992 -0.278488 -0.341433 0.143694 -0.221347 0.274915 0.238114 -0.487294 -0.258236 -0.258097 -0.661573 -0.660661 0.321498 0.346214 0.244266 0.333242 0.254606 0.260622 0.241719 0.226598 0.224997 0.237788 0.223648 0.253800 0.222351 0.252450 0.233661 0.219258
chargesum: 0.00000
title: Mulliken charges with hydrogens summed into heavy atoms:
elementType: S O O O O O N N C C C C C C C C C C C C C C
charge: 0.229634 -0.281218 -0.255403 -0.304347 -0.202482 -0.221868 -0.099967 -0.046079 0.233077 0.310792 0.052506 -0.278488 -0.097167 0.143694 0.033259 0.274915 0.238114 -0.226672 0.210080 0.204687 0.038226 0.044708
polarizability: 2.97382016e+02 -3.45965400e+00 1.56270830e+02 1.58673766e+01 1.71539734e+01 1.76568980e+02
1716.lowfreq: -12.7852 -5.0876 -0.0013 0.0009 0.0013 2.5990 5.9223 16.0737 21.3936
frequency: -11.2246 15.6900 21.2941 29.1019 38.5728 47.0390 59.5616 68.7899 80.5581 99.7756 107.0446 128.7237 148.4793 197.3672 214.8725 222.8788 238.6006 254.1311 268.1527 280.2339 309.8591 313.6032 335.5297 363.6014 408.7890 439.3411 468.8066 486.0547 533.3377 541.7622 556.8907 557.9537 591.5126 612.7171 654.3318 660.9681 679.6949 690.8641 707.3064 714.4409 732.2076 737.3381 750.8183 794.2918 800.3940 802.5818 812.3152 816.6978 823.9200 867.9099 911.7334 914.7505 961.9880 1012.7995 1016.5858 1035.8282 1072.3900 1094.9804 1095.8194 1097.7299 1139.3258 1156.0058 1156.9451 1167.2319 1186.1449 1217.2717 1230.2516 1255.8248 1275.4685 1275.9692 1280.7826 1303.9100 1353.1489 1353.8756 1379.1582 1389.5730 1391.8525 1392.5676 1409.3796 1456.9543 1459.7171 1463.8322 1464.8094 1465.4247 1483.9299 1484.8385 1486.6728 1521.9583 1553.3679 1581.1819 1628.8025 1666.9558 2994.3456 2995.1367 3031.2819 3034.4362 3041.9695 3089.1411 3090.6754 3096.2878 3096.5843 3122.5160 3122.5706 3186.4030 3216.0934 3236.8573 3568.0706 3573.5055
redmass: 4.0288 4.6634 5.6013 4.3114 4.1070 3.9172 6.1326 5.1990 4.6087 4.7585 7.4132 5.0472 4.2812 2.0814 1.4326 3.9400 2.2973 3.9928 3.5302 5.0118 3.2297 3.2249 9.9618 4.9509 4.3605 3.5346 3.9195 5.3753 11.2478 3.5985 4.5001 2.0201 3.9162 5.7075 4.5327 1.8360 1.1498 5.0682 6.0613 2.6700 4.4086 3.6535 2.7516 2.9547 1.4944 4.7239 1.6718 1.6460 3.1814 1.3116 3.2253 3.7944 5.8639 2.9845 3.2040 2.5400 2.0171 1.7274 2.1641 2.0701 2.3683 1.6916 1.6948 6.7279 3.7272 1.4455 1.8372 1.3188 1.1321 1.1344 1.4453 1.4526 1.2772 1.2752 6.7864 5.4668 1.2319 1.2331 9.1365 1.0960 1.0849 1.0469 1.1993 2.3506 1.0530 1.0766 2.9938 4.4001 8.4107 6.2228 10.2877 10.3409 1.0361 1.0362 1.0596 1.0596 1.0828 1.0976 1.0974 1.1029 1.1032 1.1065 1.1064 1.0922 1.0980 1.1000 1.0809 1.0775
irintensity: 1.2829 0.0533 0.0744 1.0277 1.2720 0.4849 3.8340 4.0725 0.1863 1.1739 1.0103 0.8795 6.6815 1.6760 2.1920 13.8684 1.1319 0.1957 5.4241 1.4660 11.1270 14.4396 5.3969 4.4870 5.1098 3.3357 2.1641 34.8001 6.1255 31.3764 41.8199 45.0989 9.7015 18.5901 34.4307 2.2092 104.3338 5.7000 15.3798 114.0458 0.0774 4.4565 13.0035 4.9352 46.4381 9.8673 2.6056 5.5899 0.3463 8.3310 42.9858 45.5999 3.9087 102.9582 120.0506 3.9656 11.5498 53.5346 38.1590 10.1103 48.3226 21.9853 32.0683 322.2118 157.8270 22.4318 170.3277 11.5021 3.7648 6.0460 42.9689 168.1865 0.5351 0.2476 17.1549 67.3587 24.3995 20.3515 13.6692 14.4316 17.5707 18.2354 18.5001 7.9986 15.6980 5.1015 410.2209 184.8849 6.4544 268.0626 143.9844 273.7182 16.1233 15.0427 27.0142 29.7827 29.8024 36.6473 32.0582 2.2381 0.8621 10.0681 41.1705 5.2328 3.6484 1.0673 104.0595 27.3937
temp: 298.150 k
press: 1.00000 atm
elementType: 16 8 8 8 8 8 7 7 6 6 6 6 6 6 6 6 6 6 6 6 6 6 1 1 1 1 1 1 1 1 1 1 1 1 1 1 1 1
symmnumber: 1
zpe: 752632.4 jmol-1
zpe.correction: 0.286663 hartree
zpe.thermalcorrener: 0.308426 hartree
zpe.thermalcorrenthalpy: 0.309370 hartree
zpe.thermalcorrgfe: 0.231772 hartree
zpe.sumelectzpe: -1425.150820 hartree
zpe.sumelectthermal: -1425.129057 hartree
zpe.sumelectthermalent: -1425.128113 hartree
zpe.sumelectthermalfe: -1425.205711 hartree
dipole: -2.0848 0.1451 -4.1472
dipole: 4.6440
quadrupole: -132.6170 -121.5115 -136.9345
quadrupole: -5.1618 -21.5546 3.5652
quadrupole: -2.2627 8.8428 -6.5801 -5.1618 -21.5546 3.5652
hfenergy: -1425.4374829 hartree
pointgroup: C01 [X(C14H16N2O5S1)]
dipole: -0.8434281 0.1880336 1.6098356 debye
polarizability: 297.3916742|-9.416625|160.8808471|-11.9003116|19.9705411|171.9493048 unknown
InChI: InChI=1S/C14H16N2O5S/c1-3-20-13(18)11(14(19)21-4-2)16-12(17)9-7-10-8(15-9)5-6-22-10/h5-7,11,15-16H,3-4H2,1-2H3
charge 0 multiplicity 1
38 atoms
S  -5.278529 1.310373 1.498723
O  2.760966 1.617696 0.703078
O  1.637403 -1.819516 1.243912
O  -0.442065 -0.844854 -2.071525
O  3.36659 1.510557 -1.554912
O  3.726209 -1.616246 0.218242
N  -3.017092 -0.277052 -1.236924
N  0.499884 0.142475 -0.173414
C  -1.92359 0.101388 -0.445368
C  -4.18828 0.115903 -0.612133
C  1.859887 -0.204434 -0.556525
C  -3.819385 0.75704 0.604282
C  -2.402716 0.753351 0.71846
C  -0.583955 -0.23761 -0.954707
C  -5.601226 0.048424 -0.859713
C  2.756405 1.051336 -0.572675
C  2.526356 -1.282335 0.327979
C  -6.319763 0.63896 0.168185
C  3.559291 2.875084 0.877079
C  2.167006 -2.919924 2.117926
C  2.728141 4.101358 0.493137
C  2.052164 -4.270007 1.407475
H  1.818989 -0.599565 -1.588492
H  -2.884683 -0.761084 -2.12669
H  -1.800105 1.164443 1.526521
H  0.356599 0.539555 0.755551
H  -6.071902 -0.402852 -1.735186
H  -7.399525 0.742048 0.263354
H  4.469757 2.792192 0.258466
H  3.823252 2.864869 1.9463
H  1.527053 -2.862692 3.012479
H  3.21412 -2.683834 2.376921
H  1.794968 4.149753 1.080539
H  2.476192 4.085094 -0.580296
H  3.309786 5.019727 0.695433
H  2.708963 -4.307035 0.522504
H  1.012719 -4.461386 1.09078
H  2.358414 -5.077901 2.097633
